program: Orca
programVersion: 5.0.2
elementType: Cl F F O O O N N N C C C C C C C C C C C C C C C C C C C C C C C C C H H H H H H H H H H H H H H H H H H H H
charge: 0
multiplicity: 1
keywords: wb97x-d3
keywords: def2-TZVPP
keywords: def2/J RIJCOSX
keywords: DEFGRID2
keywords: scfconv7
keywords: smallprint printgap noloewdin
keywords: NOSOSCF
formula: C25H20ClF2N3O3
InChI: InChI=1/C25H20ClF2N3O3/c26-18-10-8-17(9-11-18)23(16-6-7-16)31-34-14-15-4-12-19(13-5-15)29-25(33)30-24(32)22-20(27)2-1-3-21(22)28/h1-5,8-13,16,29-30H,6-7,14H2
54 atoms
Cl -6.382328 -1.044826 -5.696053
F  6.681473 -0.54074 -0.768832
F  6.426669 1.546805 3.400195
O  -4.006882 1.092247 -0.266742
O  2.258633 -0.259117 2.982902
O  4.706196 1.457336 0.113002
N  -4.145681 0.031338 0.59406
N  2.208896 1.134052 1.175932
N  4.207285 0.240807 1.976629
C  -4.916084 -2.159445 0.901721
C  -6.158078 -2.999994 0.757213
C  -4.843175 -3.55081 0.331866
C  -4.701532 -0.977238 0.047484
C  -5.124487 -1.000154 -1.374038
C  -4.229181 -1.396005 -2.362084
C  -6.409227 -0.610956 -1.735798
C  -4.610705 -1.413965 -3.694667
C  -6.804144 -0.623911 -3.065006
C  -5.897556 -1.025925 -4.032787
C  -3.34717 2.167633 0.388809
C  -1.890948 1.89639 0.62505
C  -0.979002 1.959497 -0.4256
C  -1.414482 1.556972 1.884698
C  0.828776 1.348547 1.049411
C  0.360976 1.690128 -0.22009
C  -0.07092 1.29183 2.110875
C  2.813203 0.350796 2.087471
C  6.496274 0.489036 1.320782
C  5.057786 0.787744 1.065697
C  7.26888 -0.160008 0.36722
C  7.138194 0.878528 2.488024
C  8.602634 -0.446683 0.563866
C  8.471952 0.625244 2.726281
C  9.194942 -0.048507 1.753457
H  -4.540111 -2.034669 1.909978
H  -6.871771 -2.733928 -0.012062
H  -6.604498 -3.365151 1.672544
H  -4.37125 -4.303331 0.949454
H  -4.657395 -3.661773 -0.728943
H  -3.224008 -1.696216 -2.094979
H  -7.114971 -0.295694 -0.977986
H  -3.908647 -1.724539 -4.456277
H  -7.806468 -0.322078 -3.336372
H  -3.474265 3.014929 -0.286428
H  -3.853842 2.409431 1.327059
H  -1.315516 2.228958 -1.419669
H  -2.10113 1.510703 2.721276
H  1.056077 1.747433 -1.049196
H  0.254696 1.061659 3.112948
H  2.789361 1.493917 0.425537
H  4.609215 -0.351598 2.692655
H  9.164659 -0.972701 -0.195491
H  8.933768 0.950445 3.648388
H  10.240335 -0.26487 1.923697
elementType: Cl F O N C H
totalener: -2014.65276529 hartree
nucrepener: 3282.09585101 hartree
electener: -5296.74861630 hartree
oneelecener: -9284.51574578 hartree
twoeener: 3987.76712948 hartree
cpcmener: -0.05131270 hartree
kineticenergy: 2007.65216753 hartree
xcener: -167.130416128467 hartree
chargesum: 0.0000000
charge: -0.096812 -0.204457 -0.208223 -0.237446 -0.521543 -0.467199 -0.158696 -0.186820 -0.154028 -0.070091 -0.169942 -0.168554 0.226455 0.045348 -0.248338 -0.236580 -0.131407 -0.139180 0.088990 0.094582 -0.063986 -0.161550 -0.142834 0.194019 -0.210337 -0.222844 0.434964 -0.123030 0.408534 0.302776 0.308549 -0.245343 -0.241441 -0.065398 0.088179 0.097994 0.102477 0.102113 0.098557 0.151785 0.156388 0.146195 0.145707 0.113802 0.100579 0.146162 0.143005 0.146085 0.150253 0.204351 0.198772 0.154456 0.155413 0.169588
qa: -0.0968 -0.2045 -0.2082 -0.2374 -0.5215 -0.4672 -0.1587 -0.1868 -0.1540 -0.0701 -0.1699 -0.1686 0.2265 0.0453 -0.2483 -0.2366 -0.1314 -0.1392 0.0890 0.0946 -0.0640 -0.1616 -0.1428 0.1940 -0.2103 -0.2228 0.4350 -0.1230 0.4085 0.3028 0.3085 -0.2453 -0.2414 -0.0654 0.0882 0.0980 0.1025 0.1021 0.0986 0.1518 0.1564 0.1462 0.1457 0.1138 0.1006 0.1462 0.1430 0.1461 0.1503 0.2044 0.1988 0.1545 0.1554 0.1696
va: 1.2078 1.0937 1.0861 1.9169 1.9827 2.0392 2.9342 3.2370 3.2067 3.8605 3.8908 3.8888 3.7354 3.4725 4.0059 4.0070 3.9604 3.9699 3.8351 3.8324 3.6465 3.9630 3.9572 3.7339 3.9903 4.0113 4.3049 3.5435 4.0743 3.9548 3.9277 3.9559 3.9591 3.8080 1.0304 1.0153 1.0171 1.0171 1.0141 1.0061 1.0025 1.0035 1.0040 0.9948 1.0091 1.0037 1.0089 1.0066 1.0239 1.0338 1.0044 1.0002 0.9995 0.9836
dispcorr: -0.025166379 hartree
energy: -2014.677931672942
dipole: -25.45448 27.72957 2.27510 -6.81611 6.13623 -0.67988 10.91583 -10.28560 0.63024
magnitude: 2.45673 au
magnitude: 6.24450 debye
