program: Gaussian 09
title: 000055122
version: EM64L-G09RevD.01
frameworkgroup: C1[X(C12H5Cl3O)]
method: RPBEPBE
basis: SDD
operation: Freq
keyword: #p
keyword: freq=noraman
keyword: PBEPBE/SDD
title: #p freq=noraman PBEPBE/SDD
converged: NO NO NO NO
title: Mulliken charges:
elementType: Cl Cl Cl O C C C C C C C C C C C C H H H H H
charge: 0.000068 -0.046479 -0.038910 -0.238942 0.256028 0.202923 0.325697 0.205725 -0.393415 -0.362664 -0.289253 -0.329240 -0.102039 -0.226531 -0.219104 -0.093470 0.271413 0.250320 0.287744 0.281286 0.258845
chargesum: 0.00000
title: Mulliken charges with hydrogens summed into heavy atoms:
elementType: Cl Cl Cl O C C C C C C C C C C C C
charge: 0.000068 -0.046479 -0.038910 -0.238942 0.256028 0.202923 0.325697 0.205725 -0.122002 -0.112344 -0.289253 -0.041496 -0.102039 0.054754 0.039741 -0.093470
polarizability: 2.83827807e+02 -2.43425322e+00 1.72604912e+02 3.24556093e-03 -7.52707795e-03 5.73540650e+01
1716.lowfreq: -0.0002 0.0007 0.0014 2.2658 4.6940 9.9522 52.0438 90.2055 100.5776
frequency: 52.0385 90.1942 100.5761 134.0740 157.7185 190.1989 223.1409 237.9645 273.1347 316.9750 339.7114 374.8528 379.0875 406.6578 432.6306 500.6835 521.1478 567.6563 578.3186 589.9905 636.7521 659.5279 713.2584 732.8440 748.3780 805.4170 820.0404 831.5215 851.8365 867.2090 868.3888 878.6074 952.2822 1021.6217 1050.1164 1072.3503 1120.7070 1161.3024 1171.1560 1212.5768 1233.8254 1282.4149 1355.9702 1381.6813 1412.3659 1422.0485 1429.8243 1463.2516 1569.5768 1594.0835 1600.2966 1635.4161 3152.0720 3176.4471 3177.8725 3183.3791 3188.1645
redmass: 14.0521 6.4852 18.5064 10.8046 23.8931 5.1219 12.6153 6.3107 14.4779 5.6893 8.2251 9.9303 13.3873 8.8412 2.9769 7.6544 5.5303 4.2652 5.3898 4.3353 8.2518 9.1736 5.3914 9.7914 3.9896 7.3128 1.4461 7.6238 1.4230 1.4132 8.0344 1.4674 1.3454 6.1050 1.8603 2.2983 2.1281 2.8837 2.6118 1.7430 1.6198 2.1270 3.8429 4.8976 4.3035 5.9894 3.8906 3.8507 8.8470 8.4803 8.8083 9.1301 1.0897 1.0935 1.0964 1.0932 1.0944
irintensity: 0.1058 0.7729 0.0055 0.0005 0.3056 0.0914 0.6189 0.4620 0.3777 0.1657 0.5584 0.0733 8.6499 11.6492 7.0938 8.0506 0.0140 6.1160 0.9400 15.8512 4.3203 4.2161 1.6517 60.5480 0.2160 24.8049 50.4151 9.5589 25.5835 34.2253 145.2243 10.7188 0.2882 82.0690 15.1573 1.6166 22.1332 78.4657 1.1519 17.7051 6.8124 14.1878 26.6305 35.1459 22.2387 22.1850 70.2986 86.2596 79.0828 5.2287 8.0962 85.1214 2.7522 0.1820 2.5815 3.0423 1.3832
temp: 298.150 k
press: 1.00000 atm
elementType: 17 17 17 8 6 6 6 6 6 6 6 6 6 6 6 6 1 1 1 1 1
symmnumber: 1
zpe: 346326.9 jmol-1
zpe.correction: 0.131909 hartree
zpe.thermalcorrener: 0.144723 hartree
zpe.thermalcorrenthalpy: 0.145667 hartree
zpe.thermalcorrgfe: 0.091363 hartree
zpe.sumelectzpe: -1914.597168 hartree
zpe.sumelectthermal: -1914.584354 hartree
zpe.sumelectthermalent: -1914.583410 hartree
zpe.sumelectthermalfe: -1914.637714 hartree
dipole: -0.3350 -1.9111 0.0002
dipole: 1.9403
quadrupole: -118.4385 -107.2724 -115.1333
quadrupole: 4.2942 -0.0006 -0.0006
quadrupole: -4.8237 6.3423 -1.5186 4.2942 -0.0006 -0.0006
hfenergy: -1914.729077 hartree
pointgroup: C01 [X(C12H5Cl3O1)]
dipole: 0.1551075 0.7474442 0.0000733 debye
dipolederiv: -0.1426528 -0.133396 -0.0000078 -0.2181958 -0.7046868 -0.0000456 -0.0000173 -0.0000517 -0.0198146 -0.6142999 0.3235273 0.0000309 0.4179074 -0.398764 -0.0000289 0.0000423 -0.000029 -0.0597473 -0.9780214 0.0994662 0.0000221 0.1759103 -0.1352319 -0.0000094 0.0000114 -0.0000065 -0.0570567 -1.3010432 -0.036338 0.0000095 -0.0293513 -0.4234365 -0.0000122 0.0000167 0.0000002 -0.1357912 0.3303371 -0.1775033 -0.0000126 0.2284589 0.0547514 0.000002 0.0000004 0.0000066 0.0170311 -0.0018952 0.1819537 0.0000111 -0.2187044 -0.195795 -0.0000076 0.0000006 -0.0000114 -0.005147 0.4799406 -0.2399262 -0.0000058 -0.8589728 -0.1467319 -0.0000135 -0.0000343 -0.0000237 0.0911161 0.72098 0.214336 -0.0000078 0.5799369 0.3410545 0.0000002 -0.0000004 0.0000019 0.0832982 -0.2436908 0.1717485 0.0000136 0.0867559 -0.1166696 -0.000005 0.0000102 -0.0000086 -0.1200337 0.2486394 -0.0672668 -0.0000112 0.1620233 0.1164379 0.0000205 0.0000046 0.0000246 -0.1271113 0.3553532 0.2575787 0.0000109 0.4366475 1.1339916 0.0000841 0.0000343 0.000093 -0.0748773 -0.4438926 -0.0958046 0.0000022 -0.0775785 -0.0635538 0.0000004 -0.0000026 -0.0000103 -0.1190928 0.8386034 -0.5212344 -0.0000506 -0.7331809 0.5770847 0.000056 -0.0000733 0.0000556 -0.0612376 -0.4012153 0.0729341 0.0000064 0.1677 -0.36572 -0.0000282 0.0000023 -0.0000259 -0.0816339 -0.487086 0.145455 0.0000238 0.2713338 -0.0906382 0.0000041 0.0000391 0.0000121 -0.1196235 1.3344471 -0.1427562 -0.0000339 -0.3608875 0.2867553 0.0000309 -0.000041 0.0000287 -0.0742783 0.0974446 -0.03887 -0.0000016 -0.014397 -0.0037555 -0.0000082 0.0000014 -0.0000093 0.1704776 0.058789 0.0732639 0.0000059 0.0336965 -0.0379794 -0.0000163 0.000001 -0.0000227 0.1584575 0.0963255 0.0133688 0.0000015 0.0297408 0.0380786 -0.0000063 0.0000049 -0.0000013 0.1903916 0.0399725 -0.0290797 0.0000015 -0.0153539 0.1013776 -0.0000032 0.0000073 -0.0000051 0.1736203 0.0129649 -0.071457 -0.0000082 -0.0634891 0.033431 -0.0000135 -0.0000075 -0.0000172 0.1710526 unknown
polarizability: 283.5693246|-5.8828554|172.8633947|-0.0030102|0.0076243|57.354065 unknown
InChI: InChI=1S/C12H5Cl3O/c13-6-1-2-8-9-3-7(14)4-10(15)12(9)16-11(8)5-6/h1-5H
charge 0 multiplicity 1
21 atoms
Cl -2.594322 -3.080944 -0.000167
Cl -4.39713 2.183687 0.000205
Cl 5.340472 -0.289592 -0.000088
O  0.235608 -1.615173 -0.000049
C  -0.640386 0.568682 0.000055
C  0.818597 0.66175 0.000051
C  -0.938444 -0.828083 -0.000019
C  1.302258 -0.680566 -0.000044
C  -1.6915 1.512973 0.000104
C  1.755202 1.720542 0.000101
C  -2.253801 -1.307952 -0.000038
C  2.658473 -1.026761 -0.000094
C  -3.005224 1.009819 0.000094
C  -3.309963 -0.374105 0.000019
C  3.132885 1.414509 0.000089
C  3.555376 0.060294 -0.00004
H  -1.503725 2.589569 0.000155
H  1.431431 2.766039 0.000189
H  2.995055 -2.065608 -0.000133
H  -4.347805 -0.71613 0.000025
H  3.880946 2.211951 0.000185
