program: Orca
programVersion: 5.0.2
elementType: Cl F F O O O N N N C C C C C C C C C C C C C C C C C C C C C C C C C H H H H H H H H H H H H H H H H H H H H
charge: 0
multiplicity: 1
keywords: wb97x-d3
keywords: def2-TZVPP
keywords: def2/J RIJCOSX
keywords: DEFGRID2
keywords: scfconv7
keywords: smallprint printgap noloewdin
keywords: NOSOSCF
formula: C25H20ClF2N3O3
InChI: InChI=1/C25H20ClF2N3O3/c26-18-10-8-17(9-11-18)23(16-6-7-16)31-34-14-15-4-12-19(13-5-15)29-25(33)30-24(32)22-20(27)2-1-3-21(22)28/h1-5,8-13,16,29-30H,6-7,14H2
54 atoms
Cl -6.415249 -1.452322 -5.264677
F  6.303032 0.479973 3.715818
F  6.455921 -0.109087 -0.915617
O  -4.145625 1.070815 0.028293
O  3.002717 2.881176 -0.373672
O  4.107374 -0.314118 2.005433
N  -4.173821 0.036058 0.929424
N  2.142504 1.17933 0.876465
N  4.441282 1.450421 0.601714
C  -4.730016 -2.19813 1.346632
C  -5.849838 -3.19836 1.242847
C  -4.473922 -3.591465 0.835835
C  -4.649474 -1.039661 0.438076
C  -5.094243 -1.16126 -0.971728
C  -6.431578 -0.98458 -1.308365
C  -4.168582 -1.428765 -1.975178
C  -6.846043 -1.076741 -2.628611
C  -4.569202 -1.524641 -3.298553
C  -5.907444 -1.344042 -3.611904
C  -3.465065 2.184981 0.594417
C  -1.983201 1.964477 0.673481
C  -1.389115 1.466982 1.828698
C  -1.173809 2.200424 -0.43318
C  0.775395 1.48103 0.770776
C  -0.025888 1.231348 1.881933
C  0.191241 1.962281 -0.39814
C  3.139985 1.895329 0.326745
C  6.328309 0.194496 1.399364
C  4.853055 0.404288 1.366519
C  7.000259 0.192017 2.614815
C  7.078794 -0.08671 0.266391
C  8.349549 -0.066635 2.71743
C  8.428623 -0.364104 0.319542
C  9.055022 -0.34956 1.556582
H  -4.374348 -1.983117 2.347013
H  -6.592061 -3.064287 0.466586
H  -6.244084 -3.579491 2.175436
H  -3.907627 -4.249476 1.481392
H  -4.272939 -3.718743 -0.220522
H  -7.162299 -0.769937 -0.539165
H  -3.123899 -1.566421 -1.727067
H  -7.88808 -0.936973 -2.881524
H  -3.843119 -1.733745 -4.072173
H  -3.694553 3.016299 -0.073021
H  -3.878594 2.419273 1.578832
H  -1.992582 1.271284 2.706094
H  -1.613825 2.57629 -1.349193
H  0.421482 0.853545 2.793196
H  0.779558 2.133804 -1.286989
H  2.401687 0.461227 1.544605
H  5.155195 2.019491 0.163426
H  8.838088 -0.047902 3.681931
H  8.975338 -0.590446 -0.585569
H  10.113198 -0.56199 1.617714
elementType: Cl F O N C H
totalener: -2014.65222099 hartree
nucrepener: 3295.15351630 hartree
electener: -5309.80573729 hartree
oneelecener: -9310.54498496 hartree
twoeener: 4000.73924767 hartree
cpcmener: -0.05120108 hartree
kineticenergy: 2007.66181196 hartree
xcener: -167.131746375056 hartree
chargesum: -0.0000000
charge: -0.096715 -0.204671 -0.207917 -0.239052 -0.522488 -0.467350 -0.159601 -0.195429 -0.155109 -0.073361 -0.167561 -0.170290 0.232022 0.045240 -0.233931 -0.250661 -0.141954 -0.129572 0.087962 0.094754 -0.061984 -0.134747 -0.164997 0.198820 -0.223186 -0.206220 0.432273 -0.133896 0.415264 0.303953 0.310668 -0.242115 -0.242236 -0.067279 0.089551 0.098883 0.102044 0.101757 0.097987 0.157400 0.150183 0.146287 0.146575 0.111260 0.101605 0.141296 0.145604 0.147077 0.148281 0.205573 0.199877 0.154580 0.155419 0.170126
qa: -0.0967 -0.2047 -0.2079 -0.2391 -0.5225 -0.4674 -0.1596 -0.1954 -0.1551 -0.0734 -0.1676 -0.1703 0.2320 0.0452 -0.2339 -0.2507 -0.1420 -0.1296 0.0880 0.0948 -0.0620 -0.1347 -0.1650 0.1988 -0.2232 -0.2062 0.4323 -0.1339 0.4153 0.3040 0.3107 -0.2421 -0.2422 -0.0673 0.0896 0.0989 0.1020 0.1018 0.0980 0.1574 0.1502 0.1463 0.1466 0.1113 0.1016 0.1413 0.1456 0.1471 0.1483 0.2056 0.1999 0.1546 0.1554 0.1701
va: 1.2080 1.0933 1.0867 1.9200 1.9837 2.0394 2.9260 3.2196 3.2080 3.8619 3.8913 3.8897 3.7228 3.4728 4.0074 4.0059 3.9732 3.9587 3.8364 3.8319 3.6401 3.9209 3.9834 3.6855 4.0332 4.0032 4.3123 3.5439 4.0725 3.9480 3.9323 3.9559 3.9554 3.8081 1.0293 1.0151 1.0168 1.0171 1.0141 1.0012 1.0074 1.0040 1.0032 0.9963 1.0107 1.0153 1.0037 1.0072 1.0181 1.0339 1.0038 0.9999 0.9996 0.9835
dispcorr: -0.025363219 hartree
energy: -2014.677584211139
dipole: -23.93942 26.19676 2.25734 -6.01194 4.82660 -1.18534 11.80091 -10.80224 0.99867
magnitude: 2.73824 au
magnitude: 6.96004 debye
