program: Orca
programVersion: 5.0.2
elementType: Cl F F O O O N N N C C C C C C C C C C C C C C C C C C C C C C C C C H H H H H H H H H H H H H H H H H H H H
charge: 0
multiplicity: 1
keywords: wb97x-d3
keywords: def2-TZVPP
keywords: def2/J RIJCOSX
keywords: DEFGRID2
keywords: scfconv7
keywords: smallprint printgap noloewdin
keywords: NOSOSCF
formula: C25H20ClF2N3O3
InChI: InChI=1/C25H20ClF2N3O3/c26-18-10-8-17(9-11-18)23(16-6-7-16)31-34-14-15-4-12-19(13-5-15)29-25(33)30-24(32)22-20(27)2-1-3-21(22)28/h1-5,8-13,16,29-30H,6-7,14H2
54 atoms
Cl -7.159953 -0.619853 4.221009
F  6.010069 -0.050399 2.045089
F  6.922944 0.113396 -2.531367
O  -4.06957 0.960065 -1.050405
O  2.902996 2.942238 0.593897
O  4.352701 -0.449594 -1.269412
N  -3.95322 -0.231032 -1.721362
N  2.266515 1.165278 -0.692305
N  4.467494 1.430528 0.012512
C  -4.441597 -2.519594 -1.774906
C  -4.240667 -3.774244 -0.966297
C  -5.549634 -3.527843 -1.62936
C  -4.504695 -1.204435 -1.110457
C  -5.167913 -1.066341 0.209087
C  -6.547227 -0.913855 0.295521
C  -4.409152 -1.071943 1.375402
C  -7.167761 -0.776459 1.528272
C  -5.016521 -0.939163 2.613965
C  -6.393415 -0.790825 2.676969
C  -3.291719 1.960831 -1.69831
C  -1.82293 1.796709 -1.441938
C  -1.028291 1.012276 -2.273532
C  -1.224276 2.387858 -0.335584
C  0.907667 1.435561 -0.896846
C  0.316264 0.83301 -2.007605
C  0.123587 2.219218 -0.053286
C  3.148276 1.910328 -0.002862
C  6.419731 0.052552 -0.251472
C  4.983072 0.30696 -0.553937
C  6.885493 -0.147824 1.040346
C  7.343643 -0.080486 -1.279799
C  8.197818 -0.465466 1.317802
C  8.669714 -0.377905 -1.051636
C  9.085207 -0.573388 0.257801
H  -3.948672 -2.489422 -2.73909
H  -4.191415 -3.683214 0.111561
H  -3.577853 -4.520667 -1.383367
H  -5.799724 -4.100393 -2.512674
H  -6.397753 -3.277601 -1.005434
H  -7.15026 -0.900222 -0.603244
H  -3.334097 -1.187264 1.32307
H  -8.241132 -0.657963 1.585584
H  -4.419724 -0.949361 3.515685
H  -3.504333 1.964414 -2.770586
H  -3.649781 2.902895 -1.281748
H  -1.458072 0.540611 -3.147879
H  -1.820111 2.998744 0.332114
H  0.919419 0.223791 -2.670299
H  0.535807 2.686482 0.826622
H  2.646199 0.377399 -1.208242
H  5.095968 2.018965 0.545881
H  8.516843 -0.627489 2.338231
H  9.361771 -0.457162 -1.878702
H  10.120087 -0.815602 0.455264
elementType: Cl F O N C H
totalener: -2014.65229670 hartree
nucrepener: 3298.53159113 hartree
electener: -5313.18388783 hartree
oneelecener: -9317.23276882 hartree
twoeener: 4004.04888099 hartree
cpcmener: -0.04989958 hartree
kineticenergy: 2007.66415237 hartree
xcener: -167.133520012975 hartree
chargesum: -0.0000000
charge: -0.096442 -0.208429 -0.204422 -0.238544 -0.521002 -0.465850 -0.159896 -0.184582 -0.153787 -0.072325 -0.172172 -0.168963 0.231841 0.040801 -0.232447 -0.248707 -0.144176 -0.129700 0.089236 0.093810 -0.073058 -0.130448 -0.159030 0.198557 -0.224406 -0.212673 0.432971 -0.129209 0.409555 0.310631 0.304564 -0.241911 -0.244099 -0.064960 0.089845 0.098213 0.102255 0.102416 0.099608 0.158686 0.149630 0.146744 0.146570 0.101860 0.109079 0.139725 0.145093 0.143802 0.151218 0.206048 0.198793 0.155259 0.154958 0.169471
qa: -0.0964 -0.2084 -0.2044 -0.2385 -0.5210 -0.4658 -0.1599 -0.1846 -0.1538 -0.0723 -0.1722 -0.1690 0.2318 0.0408 -0.2324 -0.2487 -0.1442 -0.1297 0.0892 0.0938 -0.0731 -0.1304 -0.1590 0.1986 -0.2244 -0.2127 0.4330 -0.1292 0.4096 0.3106 0.3046 -0.2419 -0.2441 -0.0650 0.0898 0.0982 0.1023 0.1024 0.0996 0.1587 0.1496 0.1467 0.1466 0.1019 0.1091 0.1397 0.1451 0.1438 0.1512 0.2060 0.1988 0.1553 0.1550 0.1695
va: 1.2084 1.0861 1.0938 1.9203 1.9840 2.0427 2.9222 3.2401 3.2127 3.8600 3.8903 3.8912 3.7221 3.4748 4.0074 4.0044 3.9753 3.9579 3.8363 3.8305 3.6465 3.9142 3.9855 3.7428 4.0071 3.9853 4.3065 3.5478 4.0725 3.9282 3.9510 3.9584 3.9562 3.8082 1.0288 1.0138 1.0170 1.0168 1.0150 1.0001 1.0079 1.0040 1.0032 1.0117 0.9974 1.0189 1.0032 1.0081 1.0242 1.0350 1.0046 0.9996 1.0000 0.9836
dispcorr: -0.025322759 hartree
energy: -2014.677619459380
dipole: -21.49991 23.94677 2.44686 -8.68513 7.31044 -1.37469 -14.68564 14.37064 -0.31500
magnitude: 2.82421 au
magnitude: 7.17856 debye
