program: Orca
programVersion: 5.0.2
elementType: Cl F F O O O N N N C C C C C C C C C C C C C C C C C C C C C C C C C H H H H H H H H H H H H H H H H H H H H
charge: 0
multiplicity: 1
keywords: wb97x-d3
keywords: def2-TZVPP
keywords: def2/J RIJCOSX
keywords: DEFGRID2
keywords: scfconv7
keywords: smallprint printgap noloewdin
keywords: NOSOSCF
formula: C25H20ClF2N3O3
InChI: InChI=1/C25H20ClF2N3O3/c26-18-10-8-17(9-11-18)23(16-6-7-16)31-34-14-15-4-12-19(13-5-15)29-25(33)30-24(32)22-20(27)2-1-3-21(22)28/h1-5,8-13,16,29-30H,6-7,14H2
54 atoms
Cl -1.120613 0.443159 -4.723763
F  5.704632 1.651331 0.180214
F  4.465816 -2.335809 2.26368
O  -5.27988 1.055457 0.183967
O  1.319734 0.939838 -1.220142
O  3.095237 0.209979 2.443041
N  -5.261604 -0.252824 0.655041
N  0.921044 0.997511 1.026794
N  3.001411 0.392792 0.172212
C  -4.428471 -2.450394 0.405437
C  -3.635733 -2.760129 1.654959
C  -5.113596 -2.946076 1.639789
C  -4.53531 -1.041197 -0.038166
C  -3.728054 -0.666823 -1.221035
C  -4.256528 0.038541 -2.300149
C  -2.387068 -1.043029 -1.253777
C  -3.460649 0.374034 -3.38304
C  -1.57582 -0.698436 -2.322996
C  -2.12293 0.010462 -3.37968
C  -4.700303 1.924325 1.150941
C  -3.207374 1.773648 1.168045
C  -2.574982 0.994672 2.128906
C  -2.432567 2.324615 0.151457
C  -0.453458 1.282658 1.02462
C  -1.213964 0.747121 2.060401
C  -1.067826 2.099801 0.076917
C  1.680455 0.800782 -0.06547
C  5.037135 -0.331728 1.216305
C  3.62497 0.125085 1.351009
C  6.036443 0.445174 0.649479
C  5.413654 -1.56839 1.722381
C  7.348936 0.029311 0.575392
C  6.708507 -2.034688 1.659388
C  7.67255 -1.220285 1.082498
H  -4.311305 -3.157453 -0.407265
H  -3.234562 -1.917797 2.204457
H  -2.997296 -3.633395 1.634591
H  -5.499808 -3.956152 1.605751
H  -5.722908 -2.249409 2.198329
H  -5.300937 0.316167 -2.319179
H  -1.955673 -1.594453 -0.428321
H  -3.884274 0.914906 -4.218184
H  -0.533833 -0.985637 -2.329176
H  -4.993299 2.928512 0.841598
H  -5.126906 1.732865 2.140664
H  -3.151472 0.560417 2.936659
H  -2.900204 2.946862 -0.602399
H  -0.739437 0.123553 2.808438
H  -0.498169 2.56668 -0.711823
H  1.327966 0.734593 1.918721
H  3.52673 0.240234 -0.680094
H  8.100564 0.669294 0.134178
H  6.957329 -3.01118 2.051704
H  8.695314 -1.566038 1.0284
elementType: Cl F O N C H
totalener: -2014.64697431 hartree
nucrepener: 3587.75128809 hartree
electener: -5602.39826239 hartree
oneelecener: -9895.95685154 hartree
twoeener: 4293.55858915 hartree
cpcmener: -0.05052633 hartree
kineticenergy: 2007.65813836 hartree
xcener: -167.133822966822 hartree
chargesum: -0.0000000
charge: -0.094103 -0.208046 -0.204819 -0.276606 -0.530293 -0.466070 -0.151336 -0.186305 -0.150309 -0.063969 -0.172771 -0.156994 0.175254 0.084916 -0.198558 -0.209810 -0.158843 -0.235903 0.151048 0.079964 -0.030340 -0.146299 -0.150833 0.220139 -0.217623 -0.250360 0.438993 -0.129995 0.414519 0.316882 0.298764 -0.245974 -0.244054 -0.064873 0.115304 0.099293 0.100212 0.101591 0.082703 0.143051 0.160614 0.143995 0.138003 0.112654 0.102522 0.148177 0.142527 0.145628 0.143846 0.204481 0.199432 0.155218 0.155285 0.170071
qa: -0.0941 -0.2080 -0.2048 -0.2766 -0.5303 -0.4661 -0.1513 -0.1863 -0.1503 -0.0640 -0.1728 -0.1570 0.1753 0.0849 -0.1986 -0.2098 -0.1588 -0.2359 0.1510 0.0800 -0.0303 -0.1463 -0.1508 0.2201 -0.2176 -0.2504 0.4390 -0.1300 0.4145 0.3169 0.2988 -0.2460 -0.2441 -0.0649 0.1153 0.0993 0.1002 0.1016 0.0827 0.1431 0.1606 0.1440 0.1380 0.1127 0.1025 0.1482 0.1425 0.1456 0.1438 0.2045 0.1994 0.1552 0.1553 0.1701
va: 1.2129 1.0867 1.0932 1.8626 1.9676 2.0413 2.8601 3.2263 3.2183 3.7528 3.9116 3.9258 3.7584 3.4544 3.9775 3.9455 3.9942 4.0054 3.7801 3.8803 3.5456 3.8907 3.9342 3.6414 4.0002 3.9399 4.2919 3.5421 4.0656 3.9286 3.9523 3.9586 3.9574 3.8062 1.0055 1.0163 1.0175 1.0157 1.0415 1.0182 0.9874 1.0064 1.0267 0.9970 1.0107 1.0009 1.0052 1.0087 1.0242 1.0363 1.0043 0.9999 0.9996 0.9835
dispcorr: -0.032168194 hartree
energy: -2014.679142499640
dipole: -29.12711 31.94262 2.81551 -7.74325 6.28608 -1.45717 13.10007 -12.30200 0.79807
magnitude: 3.26915 au
magnitude: 8.30952 debye
