program: Orca
programVersion: 5.0.2
elementType: Cl F F O O O N N N C C C C C C C C C C C C C C C C C C C C C C C C C H H H H H H H H H H H H H H H H H H H H
charge: 0
multiplicity: 1
keywords: wb97x-d3
keywords: def2-TZVPP
keywords: def2/J RIJCOSX
keywords: DEFGRID2
keywords: scfconv7
keywords: smallprint printgap noloewdin
keywords: NOSOSCF
formula: C25H20ClF2N3O3
InChI: InChI=1/C25H20ClF2N3O3/c26-18-10-8-17(9-11-18)23(16-6-7-16)31-34-14-15-4-12-19(13-5-15)29-25(33)30-24(32)22-20(27)2-1-3-21(22)28/h1-5,8-13,16,29-30H,6-7,14H2
54 atoms
Cl -5.785935 -0.347353 -5.900691
F  6.592572 2.301245 1.439549
F  5.898435 -2.279049 1.995067
O  -4.299304 0.997441 0.253809
O  2.74248 1.516442 -0.958524
O  4.034966 -0.055349 2.651364
N  -4.296994 -0.275984 0.763084
N  2.001618 0.914134 1.119522
N  4.239407 0.708013 0.512403
C  -4.851419 -2.548091 0.401571
C  -4.610223 -2.931783 1.827447
C  -6.009534 -2.854076 1.321248
C  -4.662902 -1.160229 -0.078441
C  -4.946222 -0.912274 -1.510778
C  -6.150591 -1.341925 -2.060703
C  -4.000822 -0.311928 -2.340761
C  -6.421794 -1.162646 -3.408673
C  -4.251901 -0.142793 -3.69178
C  -5.465988 -0.564215 -4.212786
C  -3.622379 1.87829 1.139227
C  -2.13908 1.658012 1.130126
C  -1.374533 2.03929 0.0333
C  -1.492385 1.031109 2.188861
C  0.630547 1.186154 1.048069
C  -0.007091 1.816496 -0.021092
C  -0.128889 0.800573 2.153806
C  2.931669 1.081549 0.162508
C  6.199276 0.015894 1.70404
C  4.721972 0.21732 1.684981
C  7.09212 1.071729 1.596659
C  6.739313 -1.247432 1.896932
C  8.458157 0.900236 1.667002
C  8.097476 -1.472116 1.960897
C  8.950368 -0.383931 1.845943
H  -4.640602 -3.302391 -0.346981
H  -4.269424 -2.167244 2.511469
H  -4.183849 -3.911419 1.999514
H  -6.555406 -3.772439 1.149467
H  -6.616753 -2.017164 1.641589
H  -6.894768 -1.818263 -1.435302
H  -3.046064 0.008026 -1.944664
H  -7.365369 -1.492088 -3.821441
H  -3.50566 0.312494 -4.328292
H  -3.867338 2.875918 0.771368
H  -4.023653 1.783935 2.1525
H  -1.849237 2.534032 -0.806106
H  -2.057609 0.719826 3.058742
H  0.538092 2.143876 -0.890149
H  0.351852 0.311869 2.993118
H  2.324686 0.505595 1.991298
H  4.903939 0.855232 -0.238059
H  9.120781 1.750721 1.585809
H  8.479471 -2.4744 2.097393
H  10.018765 -0.54008 1.898286
elementType: Cl F O N C H
totalener: -2014.65142397 hartree
nucrepener: 3305.22303436 hartree
electener: -5319.87445832 hartree
oneelecener: -9330.57513089 hartree
twoeener: 4010.70067257 hartree
cpcmener: -0.04773249 hartree
kineticenergy: 2007.65783155 hartree
xcener: -167.132534728052 hartree
chargesum: -0.0000000
charge: -0.095997 -0.208547 -0.204980 -0.246784 -0.520464 -0.465295 -0.183875 -0.168951 -0.150047 -0.106566 -0.165120 -0.164720 0.255808 0.027978 -0.215545 -0.202083 -0.162125 -0.170784 0.115810 0.098083 -0.058367 -0.199953 -0.136116 0.190563 -0.204988 -0.223392 0.431864 -0.123132 0.402355 0.312780 0.305346 -0.244811 -0.247375 -0.065283 0.116116 0.084948 0.102403 0.096563 0.093905 0.160686 0.159662 0.144890 0.144121 0.114287 0.099588 0.147244 0.146614 0.157873 0.143629 0.203502 0.198597 0.155507 0.154787 0.169791
qa: -0.0960 -0.2085 -0.2050 -0.2468 -0.5205 -0.4653 -0.1839 -0.1690 -0.1500 -0.1066 -0.1651 -0.1647 0.2558 0.0280 -0.2155 -0.2021 -0.1621 -0.1708 0.1158 0.0981 -0.0584 -0.2000 -0.1361 0.1906 -0.2050 -0.2234 0.4319 -0.1231 0.4024 0.3128 0.3053 -0.2448 -0.2474 -0.0653 0.1161 0.0849 0.1024 0.0966 0.0939 0.1607 0.1597 0.1449 0.1441 0.1143 0.0996 0.1472 0.1466 0.1579 0.1436 0.2035 0.1986 0.1555 0.1548 0.1698
va: 1.2090 1.0858 1.0931 1.9223 1.9850 2.0438 2.8869 3.2581 3.2143 3.7918 3.9269 3.9134 3.7270 3.5600 4.0047 4.0069 4.0032 4.0190 3.8164 3.8435 3.6233 3.9818 3.9254 3.8076 3.9651 3.9743 4.3006 3.5475 4.0727 3.9284 3.9536 3.9586 3.9601 3.8065 1.0042 1.0355 1.0150 1.0183 1.0189 0.9918 0.9971 1.0071 1.0074 0.9950 1.0105 1.0048 1.0029 1.0292 1.0075 1.0351 1.0044 0.9995 1.0001 0.9835
dispcorr: -0.025417201 hartree
energy: -2014.676841167860
dipole: -25.46392 27.80108 2.33716 -6.67923 5.71225 -0.96698 13.93410 -12.92767 1.00643
magnitude: 2.72218 au
magnitude: 6.91923 debye
