program: Orca
programVersion: 5.0.2
elementType: Cl F F O O O N N N C C C C C C C C C C C C C C C C C C C C C C C C C H H H H H H H H H H H H H H H H H H H H
charge: 0
multiplicity: 1
keywords: wb97x-d3
keywords: def2-TZVPP
keywords: def2/J RIJCOSX
keywords: DEFGRID2
keywords: scfconv7
keywords: smallprint printgap noloewdin
keywords: NOSOSCF
formula: C25H20ClF2N3O3
InChI: InChI=1/C25H20ClF2N3O3/c26-18-10-8-17(9-11-18)23(16-6-7-16)31-34-14-15-4-12-19(13-5-15)29-25(33)30-24(32)22-20(27)2-1-3-21(22)28/h1-5,8-13,16,29-30H,6-7,14H2
54 atoms
Cl -6.694515 -2.256428 -5.359032
F  6.775236 2.435394 1.5775
F  5.531687 -2.025049 1.014481
O  -4.154456 1.226492 -0.49023
O  2.357478 2.115655 3.20532
O  4.187395 0.371155 -0.070754
N  -4.013592 0.214884 0.425274
N  1.990478 1.516063 1.029845
N  4.057244 1.199584 2.048986
C  -4.096158 -2.102924 0.86143
C  -2.679936 -2.614982 0.989435
C  -3.35602 -1.974368 2.154333
C  -4.341079 -0.934768 -0.015697
C  -4.910459 -1.21875 -1.352547
C  -6.034288 -0.542705 -1.825221
C  -4.351712 -2.224934 -2.137702
C  -6.589037 -0.861747 -3.05352
C  -4.887061 -2.54301 -3.376096
C  -6.005726 -1.857603 -3.821314
C  -3.553403 2.408102 0.014998
C  -2.088441 2.227533 0.289788
C  -1.536326 2.609308 1.502683
C  -1.249823 1.639294 -0.654695
C  0.631712 1.803093 0.853321
C  -0.191312 2.415819 1.794055
C  0.085857 1.42811 -0.378319
C  2.729969 1.650906 2.144011
C  6.1103 0.216994 1.285563
C  4.69761 0.605628 1.009081
C  7.112522 1.143887 1.526064
C  6.487511 -1.116908 1.223874
C  8.433242 0.783259 1.691297
C  7.791446 -1.528625 1.392127
C  8.760702 -0.562359 1.621512
H  -4.865656 -2.86468 0.809988
H  -1.905319 -2.052057 0.483548
H  -2.5323 -3.686859 0.993491
H  -3.682094 -2.61092 2.966141
H  -3.025623 -0.991241 2.459581
H  -6.506558 0.223892 -1.226389
H  -3.482666 -2.767486 -1.788779
H  -7.468559 -0.33865 -3.40301
H  -4.437138 -3.31994 -3.978871
H  -3.722408 3.152508 -0.765454
H  -4.069225 2.751275 0.917158
H  -2.167312 3.064763 2.256566
H  -1.640469 1.326832 -1.615532
H  0.183318 2.732801 2.752834
H  0.718612 0.958863 -1.122665
H  2.452931 1.082139 0.236375
H  4.574399 1.305947 2.9135
H  9.187409 1.538061 1.866488
H  8.043907 -2.578953 1.345141
H  9.790518 -0.864929 1.749768
elementType: Cl F O N C H
totalener: -2014.65023948 hartree
nucrepener: 3325.58083459 hartree
electener: -5340.23107407 hartree
oneelecener: -9371.26277516 hartree
twoeener: 4031.03170109 hartree
cpcmener: -0.04774547 hartree
kineticenergy: 2007.65898922 hartree
xcener: -167.134254563119 hartree
chargesum: 0.0000000
charge: -0.095636 -0.208187 -0.205249 -0.245561 -0.520788 -0.466100 -0.180245 -0.170139 -0.150338 -0.088663 -0.174403 -0.160194 0.244292 0.011200 -0.182376 -0.216555 -0.176641 -0.168734 0.121282 0.107548 -0.015473 -0.168584 -0.198749 0.186360 -0.214763 -0.204188 0.430954 -0.131416 0.407279 0.319958 0.302948 -0.247234 -0.245994 -0.066246 0.114630 0.094763 0.098550 0.101514 0.082462 0.148651 0.165322 0.145598 0.145805 0.110387 0.097588 0.143898 0.138293 0.155875 0.144495 0.202819 0.199576 0.154728 0.155249 0.170438
qa: -0.0956 -0.2082 -0.2052 -0.2456 -0.5208 -0.4661 -0.1802 -0.1701 -0.1503 -0.0887 -0.1744 -0.1602 0.2443 0.0112 -0.1824 -0.2166 -0.1766 -0.1687 0.1213 0.1075 -0.0155 -0.1686 -0.1987 0.1864 -0.2148 -0.2042 0.4310 -0.1314 0.4073 0.3200 0.3029 -0.2472 -0.2460 -0.0662 0.1146 0.0948 0.0986 0.1015 0.0825 0.1487 0.1653 0.1456 0.1458 0.1104 0.0976 0.1439 0.1383 0.1559 0.1445 0.2028 0.1996 0.1547 0.1552 0.1704
va: 1.2095 1.0861 1.0926 1.9293 1.9854 2.0450 2.9087 3.2585 3.2183 3.7730 3.9125 3.9279 3.7415 3.5802 3.9915 4.0052 4.0099 4.0199 3.8172 3.8368 3.6292 3.9797 3.9645 3.8064 3.9644 3.9418 4.3023 3.5499 4.0686 3.9271 3.9508 3.9590 3.9594 3.8048 1.0038 1.0147 1.0177 1.0158 1.0345 1.0144 0.9887 1.0065 1.0075 0.9942 1.0076 1.0027 1.0145 1.0306 1.0075 1.0368 1.0037 1.0001 0.9997 0.9833
dispcorr: -0.025696391 hartree
energy: -2014.675935870762
dipole: -16.41733 18.95237 2.53504 -1.31326 0.24626 -1.06700 12.10283 -11.59435 0.50848
magnitude: 2.79705 au
magnitude: 7.10953 debye
