program: Orca
programVersion: 5.0.2
elementType: Cl F F O O O N N N C C C C C C C C C C C C C C C C C C C C C C C C C H H H H H H H H H H H H H H H H H H H H
charge: 0
multiplicity: 1
keywords: wb97x-d3
keywords: def2-TZVPP
keywords: def2/J RIJCOSX
keywords: DEFGRID2
keywords: scfconv7
keywords: smallprint printgap noloewdin
keywords: NOSOSCF
formula: C25H20ClF2N3O3
InChI: InChI=1/C25H20ClF2N3O3/c26-18-10-8-17(9-11-18)23(16-6-7-16)31-34-14-15-4-12-19(13-5-15)29-25(33)30-24(32)22-20(27)2-1-3-21(22)28/h1-5,8-13,16,29-30H,6-7,14H2
54 atoms
Cl -6.02038 -2.742314 -5.518721
F  5.709151 -1.890676 1.409184
F  6.746496 2.661221 1.226671
O  -4.187453 1.100229 -0.646874
O  2.462901 2.739394 2.797681
O  4.181879 0.138326 0.085483
N  -4.322568 0.217651 0.390623
N  1.997573 1.480374 0.947932
N  4.119604 1.50755 1.903753
C  -4.791275 -1.981766 1.098181
C  -3.512617 -2.497104 1.716805
C  -4.454781 -1.670521 2.522396
C  -4.708543 -0.943789 0.042043
C  -5.037863 -1.361966 -1.33993
C  -4.473411 -2.527469 -1.853451
C  -5.925975 -0.640159 -2.136007
C  -4.763709 -2.95586 -3.139318
C  -6.237987 -1.066472 -3.41607
C  -5.644763 -2.217007 -3.911974
C  -3.541803 2.272786 -0.192915
C  -2.093566 2.051796 0.143248
C  -1.504948 2.710437 1.212506
C  -1.292019 1.212562 -0.626768
C  0.635499 1.724049 0.741649
C  -0.157858 2.565261 1.518303
C  0.047295 1.049046 -0.331883
C  2.789908 1.964012 1.921762
C  6.172197 0.396966 1.324382
C  4.735629 0.667664 1.029308
C  6.613391 -0.912397 1.47184
C  7.135547 1.39379 1.395521
C  7.93436 -1.229813 1.703553
C  8.470429 1.124744 1.612814
C  8.858208 -0.197164 1.769829
H  -5.563951 -2.722728 0.929587
H  -2.588123 -2.03764 1.389261
H  -3.444433 -3.558343 1.919226
H  -5.046397 -2.16488 3.282285
H  -4.1675 -0.656491 2.765333
H  -3.787211 -3.109813 -1.251592
H  -6.403002 0.253477 -1.757628
H  -4.306235 -3.855681 -3.527731
H  -6.935826 -0.501274 -4.019023
H  -3.637919 2.977113 -1.022979
H  -4.072533 2.701622 0.663337
H  -2.10671 3.361173 1.836452
H  -1.708603 0.673388 -1.468872
H  0.245886 3.102546 2.360334
H  0.648971 0.387368 -0.944613
H  2.434979 0.834118 0.297844
H  4.658282 1.85434 2.687861
H  8.234263 -2.261417 1.828749
H  9.190036 1.931223 1.653877
H  9.899961 -0.427822 1.945682
elementType: Cl F O N C H
totalener: -2014.66571621 hartree
nucrepener: 3303.95261720 hartree
electener: -5318.61833340 hartree
oneelecener: -9327.84227834 hartree
twoeener: 4009.22394494 hartree
cpcmener: -0.03963411 hartree
kineticenergy: 2007.65389740 hartree
xcener: -167.132667914899 hartree
chargesum: 0.0000000
charge: -0.093756 -0.201131 -0.206230 -0.237246 -0.494673 -0.447933 -0.179091 -0.174669 -0.155528 -0.097762 -0.165260 -0.157783 0.242354 0.018376 -0.213190 -0.181092 -0.165794 -0.166419 0.117550 0.114912 -0.008920 -0.162927 -0.207447 0.178420 -0.213515 -0.196618 0.417475 -0.131274 0.400957 0.297975 0.310149 -0.238945 -0.242124 -0.063485 0.113912 0.092758 0.095571 0.098971 0.083271 0.158394 0.142751 0.141777 0.142004 0.105532 0.095641 0.139212 0.136021 0.156607 0.139463 0.198263 0.192818 0.152431 0.152845 0.166400
qa: -0.0938 -0.2011 -0.2062 -0.2372 -0.4947 -0.4479 -0.1791 -0.1747 -0.1555 -0.0978 -0.1653 -0.1578 0.2424 0.0184 -0.2132 -0.1811 -0.1658 -0.1664 0.1176 0.1149 -0.0089 -0.1629 -0.2074 0.1784 -0.2135 -0.1966 0.4175 -0.1313 0.4010 0.2980 0.3101 -0.2389 -0.2421 -0.0635 0.1139 0.0928 0.0956 0.0990 0.0833 0.1584 0.1428 0.1418 0.1420 0.1055 0.0956 0.1392 0.1360 0.1566 0.1395 0.1983 0.1928 0.1524 0.1528 0.1664
va: 1.2115 1.0983 1.0887 1.9484 2.0178 2.0664 2.9090 3.2543 3.2121 3.7890 3.9128 3.9211 3.7284 3.5666 4.0038 3.9946 4.0157 4.0017 3.8276 3.8291 3.6336 3.9886 3.9883 3.8267 3.9675 3.9572 4.3187 3.5491 4.0782 3.9590 3.9334 3.9588 3.9596 3.8119 1.0037 1.0178 1.0180 1.0156 1.0391 0.9921 1.0174 1.0083 1.0072 0.9929 1.0144 1.0038 1.0166 1.0311 1.0085 1.0423 1.0091 1.0007 1.0008 0.9849
dispcorr: -0.025186854 hartree
energy: -2014.690903059462
dipole: -21.11651 23.42319 2.30668 -0.29652 -0.62275 -0.91927 14.10122 -13.32902 0.77220
magnitude: 2.60041 au
magnitude: 6.60971 debye
