program: Orca
programVersion: 5.0.2
elementType: Cl F F O O O N N N C C C C C C C C C C C C C C C C C C C C C C C C C H H H H H H H H H H H H H H H H H H H H
charge: 0
multiplicity: 1
keywords: wb97x-d3
keywords: def2-TZVPP
keywords: def2/J RIJCOSX
keywords: DEFGRID2
keywords: scfconv7
keywords: smallprint printgap noloewdin
keywords: NOSOSCF
formula: C25H20ClF2N3O3
InChI: InChI=1/C25H20ClF2N3O3/c26-18-10-8-17(9-11-18)23(16-6-7-16)31-34-14-15-4-12-19(13-5-15)29-25(33)30-24(32)22-20(27)2-1-3-21(22)28/h1-5,8-13,16,29-30H,6-7,14H2
54 atoms
Cl -6.4839 -4.380162 2.8756
F  6.245341 0.136533 2.41732
F  6.146454 0.813312 -2.202515
O  -4.383193 1.092343 0.116879
O  2.823626 3.588023 -0.748353
O  3.934275 -0.157538 0.610338
N  -4.211941 0.631029 -1.162221
N  1.97201 1.612452 0.024019
N  4.261331 1.937356 -0.223421
C  -4.241134 -1.19114 -2.656016
C  -3.678496 -0.373469 -3.775416
C  -2.8107 -1.38345 -3.106427
C  -4.492638 -0.599827 -1.319384
C  -4.995803 -1.511005 -0.266038
C  -6.112709 -1.198818 0.506956
C  -4.357683 -2.732328 -0.061093
C  -6.579943 -2.081908 1.466378
C  -4.804465 -3.617204 0.907189
C  -5.914006 -3.280987 1.665554
C  -3.689413 2.316372 0.265648
C  -2.198602 2.14617 0.176543
C  -1.412304 3.068031 -0.498285
C  -1.563588 1.061757 0.777415
C  0.595038 1.861779 0.040984
C  -0.030273 2.945603 -0.570075
C  -0.191765 0.919906 0.709123
C  2.958144 2.45261 -0.338513
C  6.147438 0.488877 0.110485
C  4.674617 0.711467 0.193172
C  6.877731 0.152773 1.242559
C  6.83309 0.514584 -1.095332
C  8.224207 -0.137888 1.196754
C  8.177355 0.223585 -1.192999
C  8.864423 -0.102163 -0.033586
H  -4.92952 -1.983419 -2.925428
H  -3.481922 0.673177 -3.589012
H  -4.042828 -0.593053 -4.770293
H  -2.569061 -2.296302 -3.635019
H  -2.03396 -1.024132 -2.443256
H  -6.646853 -0.27115 0.352193
H  -3.49235 -3.000755 -0.653764
H  -7.45415 -1.83192 2.052224
H  -4.291292 -4.556485 1.063338
H  -4.035437 3.050592 -0.46934
H  -3.979778 2.67894 1.254586
H  -1.8813 3.910938 -0.992534
H  -2.139369 0.312009 1.306376
H  0.532295 3.687146 -1.113445
H  0.279997 0.067248 1.183652
H  2.263157 0.709932 0.38798
H  4.972419 2.607191 -0.490604
H  8.760021 -0.387431 2.102533
H  8.672938 0.244748 -2.153989
H  9.919221 -0.33337 -0.089112
elementType: Cl F O N C H
totalener: -2014.66548431 hartree
nucrepener: 3327.15370070 hartree
electener: -5341.81918501 hartree
oneelecener: -9374.18936475 hartree
twoeener: 4032.37017974 hartree
cpcmener: -0.03987828 hartree
kineticenergy: 2007.65963370 hartree
xcener: -167.132865372825 hartree
chargesum: -0.0000000
charge: -0.093465 -0.201705 -0.206656 -0.239995 -0.493285 -0.447071 -0.174040 -0.178815 -0.155505 -0.090704 -0.157631 -0.166052 0.229758 0.019104 -0.181195 -0.210988 -0.167868 -0.168713 0.118777 0.115993 -0.010934 -0.161049 -0.206223 0.186047 -0.210521 -0.201027 0.416654 -0.129586 0.397959 0.303281 0.307706 -0.243239 -0.241261 -0.065656 0.113023 0.083231 0.099279 0.095848 0.093168 0.143509 0.158586 0.142725 0.142774 0.094749 0.106806 0.140183 0.134815 0.153450 0.139712 0.199288 0.194614 0.152523 0.152735 0.166889
qa: -0.0935 -0.2017 -0.2067 -0.2400 -0.4933 -0.4471 -0.1740 -0.1788 -0.1555 -0.0907 -0.1576 -0.1661 0.2298 0.0191 -0.1812 -0.2110 -0.1679 -0.1687 0.1188 0.1160 -0.0109 -0.1610 -0.2062 0.1860 -0.2105 -0.2010 0.4167 -0.1296 0.3980 0.3033 0.3077 -0.2432 -0.2413 -0.0657 0.1130 0.0832 0.0993 0.0958 0.0932 0.1435 0.1586 0.1427 0.1428 0.0947 0.1068 0.1402 0.1348 0.1535 0.1397 0.1993 0.1946 0.1525 0.1527 0.1669
va: 1.2115 1.0978 1.0881 1.9420 2.0191 2.0674 2.9021 3.2475 3.2072 3.7801 3.9223 3.9141 3.7390 3.5579 3.9922 3.9983 4.0025 4.0193 3.8270 3.8283 3.6298 3.9886 3.9828 3.7980 3.9770 3.9650 4.3219 3.5495 4.0842 3.9576 3.9338 3.9593 3.9618 3.8114 1.0040 1.0390 1.0156 1.0181 1.0165 1.0166 0.9918 1.0069 1.0080 1.0139 0.9934 1.0032 1.0163 1.0289 1.0087 1.0419 1.0071 1.0009 1.0006 0.9848
dispcorr: -0.025702952 hartree
energy: -2014.691187263288
dipole: -17.71698 20.19791 2.48093 6.54657 -7.28685 -0.74028 -17.00777 16.44275 -0.56502
magnitude: 2.64996 au
magnitude: 6.73566 debye
