program: Orca
programVersion: 5.0.2
elementType: Cl F F O O O N N N C C C C C C C C C C C C C C C C C C C C C C C C C H H H H H H H H H H H H H H H H H H H H
charge: 0
multiplicity: 1
keywords: wb97x-d3
keywords: def2-TZVPP
keywords: def2/J RIJCOSX
keywords: DEFGRID2
keywords: scfconv7
keywords: smallprint printgap noloewdin
keywords: NOSOSCF
formula: C25H20ClF2N3O3
InChI: InChI=1/C25H20ClF2N3O3/c26-18-10-8-17(9-11-18)23(16-6-7-16)31-34-14-15-4-12-19(13-5-15)29-25(33)30-24(32)22-20(27)2-1-3-21(22)28/h1-5,8-13,16,29-30H,6-7,14H2
54 atoms
Cl -8.380204 1.168001 3.15048
F  6.546157 1.773691 1.262697
F  6.725905 -2.236763 -1.118677
O  -3.937268 0.944871 -1.607135
O  2.242763 0.258514 1.547714
O  4.941059 0.10713 -1.597223
N  -3.76706 -0.412206 -1.645964
N  2.386668 0.539739 -0.715061
N  4.256035 0.02062 0.575689
C  -4.222686 -2.516443 -0.691342
C  -3.149395 -3.196036 -1.480567
C  -2.96419 -3.006765 -0.013032
C  -4.449384 -1.053933 -0.784815
C  -5.414176 -0.466728 0.173485
C  -6.417634 0.411558 -0.23349
C  -5.351225 -0.834185 1.516263
C  -7.335376 0.910397 0.676054
C  -6.252438 -0.329095 2.439609
C  -7.23991 0.541183 2.008701
C  -2.96358 1.562768 -2.429874
C  -1.560792 1.30705 -1.95578
C  -1.225739 1.424457 -0.611343
C  -0.561501 0.938027 -2.846933
C  1.05449 0.800499 -1.059318
C  0.060056 1.178799 -0.156046
C  0.729177 0.692901 -2.410708
C  2.877088 0.282352 0.512085
C  6.583184 -0.233971 0.072563
C  5.188106 -0.017681 -0.414685
C  7.223749 0.681997 0.894574
C  7.318843 -1.339862 -0.329232
C  8.524278 0.516982 1.321569
C  8.618083 -1.55457 0.079009
C  9.211657 -0.614551 0.90877
H  -5.118978 -3.091581 -0.487385
H  -2.551169 -2.595664 -2.152179
H  -3.367979 -4.192466 -1.84212
H  -3.046947 -3.86478 0.641801
H  -2.255129 -2.255355 0.312305
H  -6.51198 0.697081 -1.272165
H  -4.584649 -1.517941 1.85742
H  -8.116026 1.581353 0.343542
H  -6.181661 -0.616039 3.480096
H  -3.077648 1.243892 -3.471242
H  -3.205214 2.627033 -2.383742
H  -1.978683 1.713894 0.112184
H  -0.790288 0.828783 -3.900482
H  0.269871 1.293509 0.894723
H  1.489105 0.399717 -3.125818
H  3.035982 0.451096 -1.4899
H  4.569431 -0.165765 1.520474
H  8.989198 1.256862 1.958887
H  9.152446 -2.437964 -0.243773
H  10.230531 -0.76607 1.237979
elementType: Cl F O N C H
totalener: -2014.66498312 hartree
nucrepener: 3312.93889110 hartree
electener: -5327.60387422 hartree
oneelecener: -9346.04163663 hartree
twoeener: 4018.43776241 hartree
cpcmener: -0.04010997 hartree
kineticenergy: 2007.64969192 hartree
xcener: -167.130537293198 hartree
chargesum: -0.0000000
charge: -0.093560 -0.206350 -0.201951 -0.236863 -0.493939 -0.445791 -0.174758 -0.179382 -0.155253 -0.086110 -0.157137 -0.175980 0.233538 0.015731 -0.178979 -0.215281 -0.169987 -0.166030 0.119555 0.109916 -0.009532 -0.203356 -0.159168 0.183384 -0.204960 -0.201866 0.418537 -0.126578 0.391984 0.306315 0.306124 -0.241852 -0.245406 -0.065795 0.113148 0.082238 0.099026 0.096378 0.095379 0.143052 0.162292 0.142417 0.142191 0.094530 0.107266 0.134067 0.140656 0.152039 0.140483 0.197805 0.194686 0.153639 0.152641 0.166851
qa: -0.0936 -0.2063 -0.2020 -0.2369 -0.4939 -0.4458 -0.1748 -0.1794 -0.1553 -0.0861 -0.1571 -0.1760 0.2335 0.0157 -0.1790 -0.2153 -0.1700 -0.1660 0.1196 0.1099 -0.0095 -0.2034 -0.1592 0.1834 -0.2050 -0.2019 0.4185 -0.1266 0.3920 0.3063 0.3061 -0.2419 -0.2454 -0.0658 0.1131 0.0822 0.0990 0.0964 0.0954 0.1431 0.1623 0.1424 0.1422 0.0945 0.1073 0.1341 0.1407 0.1520 0.1405 0.1978 0.1947 0.1536 0.1526 0.1669
va: 1.2117 1.0882 1.0975 1.9420 2.0168 2.0658 2.9164 3.2441 3.1991 3.7804 3.9273 3.9131 3.7471 3.5837 3.9951 4.0079 4.0058 4.0234 3.8278 3.8370 3.6344 3.9925 3.9671 3.7928 3.9740 3.9694 4.3192 3.5473 4.0920 3.9345 3.9592 3.9625 3.9612 3.8111 1.0036 1.0367 1.0158 1.0177 1.0151 1.0178 0.9891 1.0072 1.0086 1.0103 0.9939 1.0184 1.0019 1.0287 1.0079 1.0399 1.0070 1.0002 1.0009 0.9847
dispcorr: -0.025588523 hartree
energy: -2014.690571643213
dipole: -13.66277 16.22994 2.56717 -9.91951 9.07319 -0.84632 -11.81428 11.96488 0.15060
magnitude: 2.70727 au
magnitude: 6.88133 debye
