program: Orca
programVersion: 5.0.2
elementType: Cl F F O O O N N N C C C C C C C C C C C C C C C C C C C C C C C C C H H H H H H H H H H H H H H H H H H H H
charge: 0
multiplicity: 1
keywords: wb97x-d3
keywords: def2-TZVPP
keywords: def2/J RIJCOSX
keywords: DEFGRID2
keywords: scfconv7
keywords: smallprint printgap noloewdin
keywords: NOSOSCF
formula: C25H20ClF2N3O3
InChI: InChI=1/C25H20ClF2N3O3/c26-18-10-8-17(9-11-18)23(16-6-7-16)31-34-14-15-4-12-19(13-5-15)29-25(33)30-24(32)22-20(27)2-1-3-21(22)28/h1-5,8-13,16,29-30H,6-7,14H2
54 atoms
Cl -5.973452 -2.234437 -5.770492
F  5.885755 -2.086338 1.218528
F  6.443454 2.541281 1.576104
O  -4.251062 1.213633 -0.544242
O  2.311523 2.111007 3.24939
O  4.097942 -0.022849 0.185184
N  -4.331495 0.217994 0.392968
N  1.882305 1.179573 1.205503
N  3.992123 1.064899 2.18344
C  -4.649104 -2.073217 0.851804
C  -3.314027 -2.613257 1.311639
C  -4.221473 -1.931267 2.278174
C  -4.653045 -0.918932 -0.078076
C  -4.9750 -1.205997 -1.494952
C  -4.327815 -2.255707 -2.142855
C  -5.942437 -0.483235 -2.190638
C  -4.620326 -2.570983 -3.460219
C  -6.257789 -0.800049 -3.501794
C  -5.588052 -1.83925 -4.128974
C  -3.586099 2.328617 0.018778
C  -2.150279 2.034747 0.353332
C  -1.346828 1.291015 -0.508199
C  -1.582973 2.500327 1.52986
C  0.538141 1.50465 0.992024
C  -0.027513 1.02895 -0.195008
C  -0.255652 2.253769 1.857485
C  2.656572 1.497787 2.259088
C  6.10553 0.233939 1.403212
C  4.639477 0.405754 1.185491
C  6.684477 -1.028751 1.365584
C  6.965692 1.311188 1.570356
C  8.041204 -1.22834 1.50366
C  8.330137 1.162426 1.70199
C  8.857745 -0.119285 1.669596
H  -5.409324 -2.816378 0.639151
H  -2.429708 -2.078598 0.986352
H  -3.197834 -3.687989 1.369345
H  -4.742101 -2.542864 3.00378
H  -3.945838 -0.947842 2.634284
H  -3.576306 -2.835077 -1.621771
H  -6.480801 0.321315 -1.707984
H  -4.099408 -3.381412 -3.951938
H  -7.019978 -0.238542 -4.025126
H  -3.657868 3.105652 -0.745994
H  -4.116934 2.689791 0.905729
H  -1.748247 0.903207 -1.436802
H  -2.186934 3.071816 2.225116
H  0.576942 0.446601 -0.881247
H  0.131543 2.640227 2.785551
H  2.328842 0.638029 0.471462
H  4.527147 1.319758 3.004142
H  8.449594 -2.229651 1.482325
H  8.965048 2.029813 1.821927
H  9.925156 -0.257326 1.774567
elementType: Cl F O N C H
totalener: -2014.66558461 hartree
nucrepener: 3318.24988680 hartree
electener: -5332.91547141 hartree
oneelecener: -9356.42045307 hartree
twoeener: 4023.50498166 hartree
cpcmener: -0.03991971 hartree
kineticenergy: 2007.64344277 hartree
xcener: -167.130208735238 hartree
chargesum: -0.0000000
charge: -0.093730 -0.200980 -0.206272 -0.237540 -0.494454 -0.448383 -0.174650 -0.172842 -0.154489 -0.085903 -0.169521 -0.157522 0.231032 0.020152 -0.216824 -0.181454 -0.164426 -0.168087 0.118132 0.112150 -0.008886 -0.204684 -0.162893 0.181985 -0.198798 -0.212089 0.417550 -0.127261 0.396796 0.303533 0.301867 -0.240245 -0.237631 -0.065462 0.112138 0.093571 0.095735 0.099343 0.082535 0.160246 0.143482 0.141373 0.141998 0.106175 0.095076 0.134327 0.139220 0.139385 0.155141 0.198576 0.192263 0.151819 0.153200 0.166227
qa: -0.0937 -0.2010 -0.2063 -0.2375 -0.4945 -0.4484 -0.1746 -0.1728 -0.1545 -0.0859 -0.1695 -0.1575 0.2310 0.0202 -0.2168 -0.1815 -0.1644 -0.1681 0.1181 0.1122 -0.0089 -0.2047 -0.1629 0.1820 -0.1988 -0.2121 0.4176 -0.1273 0.3968 0.3035 0.3019 -0.2402 -0.2376 -0.0655 0.1121 0.0936 0.0957 0.0993 0.0825 0.1602 0.1435 0.1414 0.1420 0.1062 0.0951 0.1343 0.1392 0.1394 0.1551 0.1986 0.1923 0.1518 0.1532 0.1662
va: 1.2113 1.0983 1.0886 1.9437 2.0178 2.0652 2.9076 3.2531 3.2096 3.7785 3.9135 3.9264 3.7432 3.5694 4.0037 3.9940 4.0192 4.0033 3.8258 3.8332 3.6279 3.9792 3.9862 3.8220 3.9489 3.9667 4.3178 3.5479 4.0844 3.9579 3.9341 3.9582 3.9575 3.8137 1.0043 1.0157 1.0180 1.0157 1.0381 0.9909 1.0162 1.0085 1.0071 0.9934 1.0128 1.0165 1.0037 1.0085 1.0316 1.0410 1.0092 1.0012 1.0004 0.9850
dispcorr: -0.025625292 hartree
energy: -2014.691209902456
dipole: -20.12447 22.55954 2.43507 -0.79921 0.03254 -0.76666 13.20598 -12.66237 0.54362
magnitude: 2.61014 au
magnitude: 6.63445 debye
