program: Orca
programVersion: 5.0.2
elementType: Cl F F O O O N N N C C C C C C C C C C C C C C C C C C C C C C C C C H H H H H H H H H H H H H H H H H H H H
charge: 0
multiplicity: 1
keywords: wb97x-d3
keywords: def2-TZVPP
keywords: def2/J RIJCOSX
keywords: DEFGRID2
keywords: scfconv7
keywords: smallprint printgap noloewdin
keywords: NOSOSCF
formula: C25H20ClF2N3O3
InChI: InChI=1/C25H20ClF2N3O3/c26-18-10-8-17(9-11-18)23(16-6-7-16)31-34-14-15-4-12-19(13-5-15)29-25(33)30-24(32)22-20(27)2-1-3-21(22)28/h1-5,8-13,16,29-30H,6-7,14H2
54 atoms
Cl -2.042222 -0.418229 -4.972919
F  5.80423 1.833794 0.222794
F  4.780028 -2.235186 2.261852
O  -5.041937 1.296265 0.311837
O  1.487269 0.926141 -1.196272
O  3.29566 0.308569 2.470746
N  -5.122459 0.115606 1.026145
N  1.1254 1.120672 1.047882
N  3.182153 0.433794 0.197561
C  -4.846005 -2.204278 1.027913
C  -5.188457 -3.430947 0.222395
C  -3.834819 -3.300786 0.822921
C  -4.699194 -0.891844 0.371415
C  -4.061419 -0.797203 -0.966594
C  -4.813852 -0.809352 -2.135249
C  -2.678606 -0.671257 -1.049017
C  -4.196659 -0.69953 -3.372278
C  -2.049016 -0.55269 -2.278172
C  -2.817961 -0.568574 -3.430706
C  -4.445071 2.307188 1.114189
C  -2.958152 2.114069 1.161535
C  -2.353207 1.388451 2.181442
C  -2.165442 2.544363 0.103039
C  -0.229232 1.482037 1.04398
C  -1.005997 1.071844 2.125458
C  -0.813839 2.249997 0.038703
C  1.863494 0.847046 -0.044147
C  5.248095 -0.190813 1.241314
C  3.817697 0.209539 1.378516
C  6.205001 0.647535 0.689398
C  5.688449 -1.408103 1.741049
C  7.541137 0.312099 0.629801
C  7.010014 -1.795604 1.690448
C  7.931379 -0.919278 1.134544
H  -5.290393 -2.14068 2.014109
H  -5.280222 -3.327752 -0.851658
H  -5.892541 -4.122258 0.666666
H  -3.591862 -3.89959 1.690994
H  -2.998836 -3.116937 0.160331
H  -5.89142 -0.902485 -2.089222
H  -2.079767 -0.655373 -0.1469
H  -4.789191 -0.709966 -4.277091
H  -0.974205 -0.437899 -2.326823
H  -4.703725 3.250085 0.62954
H  -4.884316 2.306912 2.116829
H  -2.940997 1.045197 3.024295
H  -2.609979 3.121361 -0.699534
H  -0.556084 0.487464 2.919563
H  -0.232984 2.620902 -0.791708
H  1.537944 0.898458 1.947811
H  3.698532 0.250359 -0.653995
H  8.25946 0.999084 0.203198
H  7.312705 -2.758912 2.077933
H  8.974147 -1.202545 1.093474
elementType: Cl F O N C H
totalener: -2014.66196092 hartree
nucrepener: 3518.58486777 hartree
electener: -5533.24682869 hartree
oneelecener: -9757.19620092 hartree
twoeener: 4223.94937223 hartree
cpcmener: -0.04133825 hartree
kineticenergy: 2007.67482470 hartree
xcener: -167.132970079495 hartree
chargesum: -0.0000000
charge: -0.093738 -0.206280 -0.202360 -0.245759 -0.500201 -0.445810 -0.163914 -0.189456 -0.153437 -0.075904 -0.168563 -0.161494 0.227882 0.119762 -0.234705 -0.345767 -0.127739 -0.116935 0.074115 0.100439 -0.074262 -0.123686 -0.123241 0.208829 -0.219887 -0.244797 0.424822 -0.131588 0.399899 0.307932 0.306237 -0.243909 -0.246085 -0.063496 0.084623 0.097102 0.101720 0.099844 0.099684 0.147279 0.184605 0.142518 0.139606 0.108174 0.097019 0.138206 0.139519 0.140420 0.143219 0.200535 0.196425 0.153498 0.152406 0.166689
qa: -0.0937 -0.2063 -0.2024 -0.2458 -0.5002 -0.4458 -0.1639 -0.1895 -0.1534 -0.0759 -0.1686 -0.1615 0.2279 0.1198 -0.2347 -0.3458 -0.1277 -0.1169 0.0741 0.1004 -0.0743 -0.1237 -0.1232 0.2088 -0.2199 -0.2448 0.4248 -0.1316 0.3999 0.3079 0.3062 -0.2439 -0.2461 -0.0635 0.0846 0.0971 0.1017 0.0998 0.0997 0.1473 0.1846 0.1425 0.1396 0.1082 0.0970 0.1382 0.1395 0.1404 0.1432 0.2005 0.1964 0.1535 0.1524 0.1667
va: 1.2136 1.0885 1.0969 1.8986 1.9990 2.0656 2.8847 3.2200 3.2040 3.8681 3.9012 3.8866 3.6968 3.3893 3.9941 4.0068 3.9500 3.9557 3.8869 3.8630 3.6256 3.8835 3.9105 3.6554 4.0076 3.9570 4.3007 3.5441 4.0847 3.9360 3.9547 3.9633 3.9622 3.8089 1.0359 1.0154 1.0168 1.0170 1.0154 1.0065 0.9748 1.0049 1.0223 0.9956 1.0143 1.0131 1.0039 1.0092 1.0259 1.0400 1.0059 1.0004 1.0009 0.9847
dispcorr: -0.030221313 hartree
energy: -2014.692182236370
dipole: -28.45075 30.97093 2.52018 -6.68061 5.42780 -1.25281 10.69456 -9.95759 0.73697
magnitude: 2.90929 au
magnitude: 7.39482 debye
