program: Orca
programVersion: 5.0.2
elementType: Cl F F O O O N N N C C C C C C C C C C C C C C C C C C C C C C C C C H H H H H H H H H H H H H H H H H H H H
charge: 0
multiplicity: 1
keywords: wb97x-d3
keywords: def2-TZVPP
keywords: def2/J RIJCOSX
keywords: DEFGRID2
keywords: scfconv7
keywords: smallprint printgap noloewdin
keywords: NOSOSCF
formula: C25H20ClF2N3O3
InChI: InChI=1/C25H20ClF2N3O3/c26-18-10-8-17(9-11-18)23(16-6-7-16)31-34-14-15-4-12-19(13-5-15)29-25(33)30-24(32)22-20(27)2-1-3-21(22)28/h1-5,8-13,16,29-30H,6-7,14H2
54 atoms
Cl -3.477673 -1.357321 -5.346937
F  4.964031 -2.195826 1.640988
F  6.237183 2.269322 1.073724
O  -4.804683 1.218403 0.288996
O  2.231982 2.26882 -1.020021
O  3.381776 0.08586 2.291682
N  -4.814395 0.125594 1.125855
N  1.436979 1.366107 0.923478
N  3.666104 1.136345 0.292204
C  -4.688277 -2.195815 1.342736
C  -5.142582 -3.523719 0.80025
C  -3.701514 -3.307642 1.097497
C  -4.649962 -0.976912 0.51119
C  -4.374121 -1.073058 -0.943665
C  -5.37373 -1.422918 -1.843247
C  -3.094212 -0.802981 -1.419957
C  -5.10455 -1.510816 -3.201314
C  -2.81129 -0.889232 -2.773421
C  -3.822685 -1.244317 -3.652937
C  -4.187744 2.317047 0.94926
C  -2.695695 2.159239 0.971432
C  -1.913528 2.642279 -0.069779
C  -2.061749 1.435714 1.978139
C  0.075561 1.679936 0.876492
C  -0.544539 2.421502 -0.128714
C  -0.701129 1.196917 1.933125
C  2.385416 1.641752 0.008585
C  5.540608 0.051353 1.341136
C  4.097294 0.425144 1.369125
C  5.920204 -1.274564 1.518812
C  6.564423 0.981406 1.214797
C  7.239206 -1.672609 1.547604
C  7.89782 0.632381 1.24966
C  8.223879 -0.704999 1.413647
H  -4.932229 -1.99499 2.37921
H  -5.444494 -3.587262 -0.237141
H  -5.723009 -4.144271 1.470561
H  -3.271393 -3.77903 1.971562
H  -3.019386 -3.206823 0.262288
H  -6.377202 -1.625914 -1.491153
H  -2.304985 -0.52558 -0.731927
H  -5.889913 -1.78297 -3.893386
H  -1.812922 -0.679759 -3.133394
H  -4.4769 3.197427 0.373225
H  -4.593269 2.42434 1.960054
H  -2.376898 3.211827 -0.867187
H  -2.635638 1.044437 2.809263
H  0.014387 2.827025 -0.955678
H  -0.23366 0.623548 2.725787
H  1.738094 0.820913 1.725916
H  4.329231 1.323127 -0.450058
H  7.490491 -2.717182 1.67284
H  8.662594 1.391472 1.154928
H  9.264154 -0.999196 1.438667
elementType: Cl F O N C H
totalener: -2014.66375522 hartree
nucrepener: 3421.81387121 hartree
electener: -5436.47762643 hartree
oneelecener: -9563.33343084 hartree
twoeener: 4126.85580441 hartree
cpcmener: -0.04080430 hartree
kineticenergy: 2007.65533771 hartree
xcener: -167.130567752818 hartree
chargesum: -0.0000000
charge: -0.095176 -0.200550 -0.206129 -0.243331 -0.493157 -0.448268 -0.158865 -0.173413 -0.154604 -0.065394 -0.161106 -0.169411 0.215216 0.086048 -0.239577 -0.278564 -0.134376 -0.122065 0.084318 0.096405 -0.076022 -0.165756 -0.133744 0.194951 -0.215675 -0.211687 0.418301 -0.128174 0.401895 0.295918 0.309089 -0.238285 -0.241500 -0.063332 0.084531 0.095886 0.101070 0.099346 0.098017 0.155970 0.151654 0.143257 0.142548 0.106611 0.098992 0.139914 0.137752 0.156824 0.139901 0.200062 0.191735 0.152419 0.152535 0.166997
qa: -0.0952 -0.2005 -0.2061 -0.2433 -0.4932 -0.4483 -0.1589 -0.1734 -0.1546 -0.0654 -0.1611 -0.1694 0.2152 0.0860 -0.2396 -0.2786 -0.1344 -0.1221 0.0843 0.0964 -0.0760 -0.1658 -0.1337 0.1950 -0.2157 -0.2117 0.4183 -0.1282 0.4019 0.2959 0.3091 -0.2383 -0.2415 -0.0633 0.0845 0.0959 0.1011 0.0993 0.0980 0.1560 0.1517 0.1433 0.1425 0.1066 0.0990 0.1399 0.1378 0.1568 0.1399 0.2001 0.1917 0.1524 0.1525 0.1670
va: 1.2096 1.0987 1.0889 1.9155 2.0190 2.0652 2.8910 3.2487 3.2150 3.8543 3.9005 3.8881 3.7155 3.4486 4.0037 4.0111 3.9720 3.9714 3.8496 3.8529 3.6147 3.9660 3.8970 3.8043 3.9567 3.9668 4.3173 3.5463 4.0773 3.9604 3.9306 3.9565 3.9589 3.8125 1.0349 1.0162 1.0168 1.0176 1.0147 1.0005 0.9963 1.0052 1.0061 0.9950 1.0141 1.0049 1.0189 1.0304 1.0090 1.0410 1.0100 1.0009 1.0011 0.9848
dispcorr: -0.027607253 hartree
energy: -2014.691362473442
dipole: -26.00595 28.53215 2.52619 -5.94248 4.55759 -1.38489 12.33774 -11.46486 0.87288
magnitude: 3.01023 au
magnitude: 7.65139 debye
