program: Orca
programVersion: 5.0.2
elementType: Cl F F O O O N N N C C C C C C C C C C C C C C C C C C C C C C C C C H H H H H H H H H H H H H H H H H H H H
charge: 0
multiplicity: 1
keywords: wb97x-d3
keywords: def2-TZVPP
keywords: def2/J RIJCOSX
keywords: DEFGRID2
keywords: scfconv7
keywords: smallprint printgap noloewdin
keywords: NOSOSCF
formula: C25H20ClF2N3O3
InChI: InChI=1/C25H20ClF2N3O3/c26-18-10-8-17(9-11-18)23(16-6-7-16)31-34-14-15-4-12-19(13-5-15)29-25(33)30-24(32)22-20(27)2-1-3-21(22)28/h1-5,8-13,16,29-30H,6-7,14H2
54 atoms
Cl -2.843281 -1.395895 -5.392826
F  5.781496 -0.111027 -1.199733
F  5.582796 0.608831 3.414289
O  -4.769221 1.505754 -0.096803
O  1.342588 -0.639415 2.607058
O  3.882768 1.564797 0.20245
N  -5.008025 0.4505 0.756063
N  1.380885 1.112248 1.145842
N  3.318522 -0.053276 1.703033
C  -5.178423 -1.865848 1.02023
C  -5.764134 -3.116885 0.422259
C  -4.354353 -3.119797 0.893243
C  -4.875607 -0.683047 0.192518
C  -4.394141 -0.855135 -1.200821
C  -3.025662 -0.833094 -1.453482
C  -5.277615 -1.036367 -2.257623
C  -2.541552 -0.999159 -2.740897
C  -4.806112 -1.202909 -3.551875
C  -3.440137 -1.184144 -3.780096
C  -4.11198 2.550707 0.607016
C  -2.660318 2.228016 0.807875
C  -1.736837 2.474965 -0.20316
C  -2.212833 1.590692 1.958109
C  0.021174 1.442089 1.084541
C  -0.415557 2.091824 -0.070052
C  -0.889368 1.201383 2.110214
C  1.933315 0.114501 1.861064
C  5.624611 0.25156 1.104231
C  4.198856 0.662169 0.952084
C  6.383042 -0.087151 -0.009588
C  6.279571 0.260634 2.328425
C  7.716769 -0.424185 0.075516
C  7.61588 -0.052208 2.460964
C  8.325554 -0.398972 1.32172
H  -5.512842 -1.612431 2.019078
H  -5.943689 -3.14538 -0.644604
H  -6.510924 -3.630012 1.013893
H  -4.111757 -3.635895 1.812821
H  -3.569624 -3.142062 0.147676
H  -2.325715 -0.689001 -0.639863
H  -6.345412 -1.047199 -2.079915
H  -1.47613 -0.983062 -2.926233
H  -5.501021 -1.344358 -4.368407
H  -4.230676 3.436161 -0.019557
H  -4.61336 2.739498 1.561294
H  -2.051577 2.970722 -1.113389
H  -2.907095 1.393768 2.765371
H  0.285643 2.2928 -0.8706
H  -0.584562 0.728425 3.029763
H  1.991175 1.599587 0.497827
H  3.680261 -0.833811 2.23669
H  8.267231 -0.700239 -0.813489
H  8.090384 -0.02183 3.432316
H  9.373161 -0.653265 1.405645
elementType: Cl F O N C H
totalener: -2014.66365140 hartree
nucrepener: 3427.41164143 hartree
electener: -5442.07529283 hartree
oneelecener: -9574.68507563 hartree
twoeener: 4132.60978280 hartree
cpcmener: -0.04180058 hartree
kineticenergy: 2007.68138178 hartree
xcener: -167.133761900771 hartree
chargesum: 0.0000000
charge: -0.095566 -0.200773 -0.206316 -0.243631 -0.492716 -0.447347 -0.159486 -0.189574 -0.157807 -0.069957 -0.162569 -0.166927 0.222750 0.094585 -0.305038 -0.235668 -0.113914 -0.133777 0.082475 0.103466 -0.068089 -0.172249 -0.130414 0.201736 -0.208575 -0.210134 0.418695 -0.128582 0.400416 0.300506 0.304935 -0.240887 -0.238945 -0.064982 0.084495 0.096232 0.101129 0.099687 0.098226 0.157049 0.153740 0.142677 0.143438 0.108337 0.096715 0.141426 0.136402 0.141053 0.147580 0.200255 0.193909 0.152405 0.152760 0.166840
qa: -0.0956 -0.2008 -0.2063 -0.2436 -0.4927 -0.4473 -0.1595 -0.1896 -0.1578 -0.0700 -0.1626 -0.1669 0.2228 0.0946 -0.3050 -0.2357 -0.1139 -0.1338 0.0825 0.1035 -0.0681 -0.1722 -0.1304 0.2017 -0.2086 -0.2101 0.4187 -0.1286 0.4004 0.3005 0.3049 -0.2409 -0.2389 -0.0650 0.0845 0.0962 0.1011 0.0997 0.0982 0.1570 0.1537 0.1427 0.1434 0.1083 0.0967 0.1414 0.1364 0.1411 0.1476 0.2003 0.1939 0.1524 0.1528 0.1668
va: 1.2093 1.0987 1.0886 1.9142 2.0187 2.0641 2.8930 3.2292 3.2029 3.8619 3.8980 3.8886 3.7068 3.4394 4.0066 4.0069 3.9632 3.9680 3.8552 3.8519 3.6122 3.9486 3.9139 3.7262 3.9767 4.0101 4.3264 3.5444 4.0870 3.9592 3.9359 3.9571 3.9597 3.8130 1.0347 1.0159 1.0170 1.0179 1.0145 0.9944 1.0024 1.0056 1.0049 0.9944 1.0146 1.0042 1.0174 1.0079 1.0260 1.0400 1.0081 1.0010 1.0006 0.9849
dispcorr: -0.027824225 hartree
energy: -2014.691475623127
dipole: -29.31048 31.75828 2.44780 -4.49050 3.58445 -0.90605 11.34246 -10.86566 0.47679
magnitude: 2.65330 au
magnitude: 6.74415 debye
