program: Orca
programVersion: 5.0.2
elementType: Cl F F O O O N N N C C C C C C C C C C C C C C C C C C C C C C C C C H H H H H H H H H H H H H H H H H H H H
charge: 0
multiplicity: 1
keywords: wb97x-d3
keywords: def2-TZVPP
keywords: def2/J RIJCOSX
keywords: DEFGRID2
keywords: scfconv7
keywords: smallprint printgap noloewdin
keywords: NOSOSCF
formula: C25H20ClF2N3O3
InChI: InChI=1/C25H20ClF2N3O3/c26-18-10-8-17(9-11-18)23(16-6-7-16)31-34-14-15-4-12-19(13-5-15)29-25(33)30-24(32)22-20(27)2-1-3-21(22)28/h1-5,8-13,16,29-30H,6-7,14H2
54 atoms
Cl -3.07184 0.134874 -5.741301
F  5.984682 1.644814 0.272745
F  5.101939 -2.082635 2.944668
O  -4.966998 1.250471 0.265509
O  1.746085 0.260574 -1.064874
O  3.475604 0.3720 2.691592
N  -4.979573 -0.033441 0.7747
N  1.298204 0.785566 1.113677
N  3.418777 0.10289 0.430126
C  -4.623863 -2.33401 0.39833
C  -3.562284 -2.700875 1.412374
C  -4.999064 -2.691872 1.803405
C  -4.688792 -0.932559 -0.078183
C  -4.330131 -0.681982 -1.493022
C  -3.106689 -1.146759 -1.969216
C  -5.169258 0.01688 -2.356502
C  -2.709842 -0.89668 -3.27352
C  -4.792579 0.257819 -3.667806
C  -3.558482 -0.191212 -4.111571
C  -4.261201 2.092678 1.160401
C  -2.789013 1.78828 1.146721
C  -2.101365 1.450315 2.305178
C  -2.085795 1.788299 -0.053703
C  -0.062317 1.11371 1.05612
C  -0.756064 1.122816 2.265916
C  -0.74177 1.459014 -0.113219
C  2.084249 0.389107 0.094443
C  5.489546 -0.211788 1.604407
C  4.03383 0.121159 1.642214
C  6.421626 0.574248 0.942418
C  5.979041 -1.299854 2.314093
C  7.774387 0.306985 0.970175
C  7.320329 -1.611684 2.366864
C  8.213005 -0.79449 1.688838
H  -4.821236 -3.074069 -0.368077
H  -2.93146 -1.897769 1.773738
H  -3.060869 -3.652211 1.289072
H  -5.496279 -3.642123 1.948553
H  -5.348319 -1.895509 2.447009
H  -2.439267 -1.692561 -1.314093
H  -6.13456 0.368223 -2.017454
H  -1.748525 -1.246116 -3.625344
H  -5.454633 0.797751 -4.331309
H  -4.458976 3.106936 0.80697
H  -4.666018 2.006217 2.174519
H  -2.620616 1.43235 3.256163
H  -2.591481 2.050572 -0.975679
H  -0.242923 0.85899 3.183734
H  -0.240177 1.482878 -1.067122
H  1.713617 0.765789 2.039564
H  3.968157 -0.188347 -0.368831
H  8.467961 0.94979 0.445035
H  7.657639 -2.474934 2.924654
H  9.269958 -1.020444 1.721666
elementType: Cl F O N C H
totalener: -2014.66209695 hartree
nucrepener: 3451.31884257 hartree
electener: -5465.98093952 hartree
oneelecener: -9622.72820308 hartree
twoeener: 4156.74726356 hartree
cpcmener: -0.03961438 hartree
kineticenergy: 2007.64504763 hartree
xcener: -167.128077615837 hartree
chargesum: 0.0000000
charge: -0.093795 -0.206349 -0.202186 -0.253729 -0.493453 -0.446533 -0.171350 -0.180504 -0.156415 -0.077447 -0.159733 -0.159124 0.223822 0.027716 -0.229112 -0.185348 -0.160189 -0.155416 0.118073 0.105980 -0.017440 -0.177288 -0.201040 0.195690 -0.194547 -0.203756 0.417654 -0.130371 0.397370 0.307947 0.305439 -0.242653 -0.245225 -0.065087 0.111457 0.092749 0.096953 0.100098 0.084353 0.154279 0.142172 0.142568 0.141518 0.111144 0.093749 0.140552 0.138698 0.141133 0.149905 0.198362 0.196210 0.152794 0.152866 0.166835
qa: -0.0938 -0.2063 -0.2022 -0.2537 -0.4935 -0.4465 -0.1713 -0.1805 -0.1564 -0.0774 -0.1597 -0.1591 0.2238 0.0277 -0.2291 -0.1853 -0.1602 -0.1554 0.1181 0.1060 -0.0174 -0.1773 -0.2010 0.1957 -0.1945 -0.2038 0.4177 -0.1304 0.3974 0.3079 0.3054 -0.2427 -0.2452 -0.0651 0.1115 0.0927 0.0970 0.1001 0.0844 0.1543 0.1422 0.1426 0.1415 0.1111 0.0937 0.1406 0.1387 0.1411 0.1499 0.1984 0.1962 0.1528 0.1529 0.1668
va: 1.2114 1.0882 1.0969 1.9004 2.0161 2.0665 2.8752 3.2415 3.2027 3.7644 3.9143 3.9229 3.7383 3.5041 3.9716 3.9807 4.0031 3.9947 3.8251 3.8527 3.5984 3.9541 3.9910 3.7755 3.9550 3.9615 4.3197 3.5455 4.0882 3.9369 3.9550 3.9602 3.9614 3.8105 1.0052 1.0155 1.0179 1.0157 1.0408 0.9970 1.0149 1.0075 1.0070 0.9953 1.0141 1.0027 1.0080 1.0076 1.0299 1.0407 1.0060 1.0006 1.0008 0.9847
dispcorr: -0.028433219 hartree
energy: -2014.690530170301
dipole: -25.89983 28.51172 2.61188 -6.12709 5.10828 -1.01881 13.99439 -13.14798 0.84640
magnitude: 2.92853 au
magnitude: 7.44374 debye
