program: Orca
programVersion: 5.0.2
elementType: Cl F F O O O N N N C C C C C C C C C C C C C C C C C C C C C C C C C H H H H H H H H H H H H H H H H H H H H
charge: 0
multiplicity: 1
keywords: wb97x-d3
keywords: def2-TZVPP
keywords: def2/J RIJCOSX
keywords: DEFGRID2
keywords: scfconv7
keywords: smallprint printgap noloewdin
keywords: NOSOSCF
formula: C25H20ClF2N3O3
InChI: InChI=1/C25H20ClF2N3O3/c26-18-10-8-17(9-11-18)23(16-6-7-16)31-34-14-15-4-12-19(13-5-15)29-25(33)30-24(32)22-20(27)2-1-3-21(22)28/h1-5,8-13,16,29-30H,6-7,14H2
54 atoms
Cl -2.854783 0.271949 -5.634404
F  5.936607 1.726921 0.488977
F  4.878773 -2.327294 2.539644
O  -5.028936 1.15202 0.350161
O  1.67168 0.678238 -1.082373
O  3.365186 0.215225 2.665133
N  -4.955654 -0.142712 0.826094
N  1.211496 0.892737 1.144259
N  3.32522 0.27452 0.387109
C  -4.389594 -2.394489 0.405744
C  -3.246041 -2.71937 1.33848
C  -4.652865 -2.803617 1.820047
C  -4.557765 -0.990564 -0.035699
C  -4.17216 -0.679117 -1.431221
C  -5.035659 -0.03721 -2.314571
C  -2.901872 -1.040302 -1.872825
C  -4.638951 0.245451 -3.611572
C  -2.48588 -0.74683 -3.161837
C  -3.361725 -0.103667 -4.021288
C  -4.381644 2.015501 1.271975
C  -2.89599 1.794072 1.255418
C  -2.218646 1.297802 2.361614
C  -2.172333 2.003099 0.085905
C  -0.152026 1.208997 1.117272
C  -0.864727 1.012285 2.299067
C  -0.81826 1.724323 0.004336
C  2.000987 0.630577 0.085493
C  5.363736 -0.291842 1.50869
C  3.925741 0.09721 1.594138
C  6.330027 0.544231 0.969992
C  5.795586 -1.50443 2.026519
C  7.666706 0.207356 0.93357
C  7.117919 -1.89212 2.000985
C  8.048165 -1.021211 1.451604
H  -4.590779 -3.129268 -0.36504
H  -2.640446 -1.890265 1.684189
H  -2.698318 -3.635548 1.158467
H  -5.083091 -3.785512 1.970045
H  -5.004829 -2.04797 2.50918
H  -6.035766 0.235491 -2.005299
H  -2.213519 -1.539739 -1.202894
H  -5.321014 0.739041 -4.290537
H  -1.489545 -1.017285 -3.484435
H  -4.638458 3.023637 0.94129
H  -4.785024 1.876476 2.280734
H  -2.752643 1.117436 3.286935
H  -2.670768 2.392458 -0.794329
H  -0.360186 0.617273 3.173309
H  -0.301576 1.915093 -0.922131
H  1.619595 0.740971 2.061256
H  3.875912 0.08358 -0.441041
H  8.392446 0.889959 0.512639
H  7.414519 -2.851968 2.401388
H  9.090991 -1.306269 1.427467
elementType: Cl F O N C H
totalener: -2014.66169066 hartree
nucrepener: 3477.84934033 hartree
electener: -5492.51103100 hartree
oneelecener: -9675.74769389 hartree
twoeener: 4183.23666289 hartree
cpcmener: -0.03994484 hartree
kineticenergy: 2007.67136471 hartree
xcener: -167.132529843619 hartree
chargesum: -0.0000000
charge: -0.093938 -0.205889 -0.202447 -0.255619 -0.493714 -0.445493 -0.164711 -0.182420 -0.155428 -0.069017 -0.168910 -0.157548 0.216051 0.035217 -0.186802 -0.234331 -0.158526 -0.158847 0.118786 0.099578 -0.004109 -0.185491 -0.204105 0.204973 -0.196470 -0.209197 0.418793 -0.128987 0.396085 0.311000 0.303580 -0.245549 -0.246617 -0.062956 0.110115 0.095362 0.098064 0.099828 0.082598 0.142783 0.155759 0.142055 0.142373 0.111989 0.094511 0.141610 0.139541 0.140193 0.148862 0.199019 0.195735 0.153303 0.152646 0.166714
qa: -0.0939 -0.2059 -0.2024 -0.2556 -0.4937 -0.4455 -0.1647 -0.1824 -0.1554 -0.0690 -0.1689 -0.1575 0.2161 0.0352 -0.1868 -0.2343 -0.1585 -0.1588 0.1188 0.0996 -0.0041 -0.1855 -0.2041 0.2050 -0.1965 -0.2092 0.4188 -0.1290 0.3961 0.3110 0.3036 -0.2455 -0.2466 -0.0630 0.1101 0.0954 0.0981 0.0998 0.0826 0.1428 0.1558 0.1421 0.1424 0.1120 0.0945 0.1416 0.1395 0.1402 0.1489 0.1990 0.1957 0.1533 0.1526 0.1667
va: 1.2112 1.0889 1.0968 1.8975 2.0143 2.0670 2.8755 3.2398 3.2015 3.7601 3.9130 3.9263 3.7554 3.5108 3.9843 3.9715 3.9956 4.0092 3.8245 3.8661 3.5693 3.9352 3.9876 3.7516 3.9509 3.9562 4.3181 3.5448 4.0865 3.9343 3.9589 3.9645 3.9627 3.8079 1.0060 1.0129 1.0176 1.0159 1.0408 1.0145 0.9941 1.0069 1.0082 0.9957 1.0131 1.0035 1.0084 1.0082 1.0297 1.0404 1.0061 1.0005 1.0008 0.9847
dispcorr: -0.028981600 hartree
energy: -2014.690672262418
dipole: -25.06191 27.75145 2.68954 -6.75808 5.59661 -1.16148 13.93344 -13.19065 0.74279
magnitude: 3.02232 au
magnitude: 7.68212 debye
