program: Orca
programVersion: 5.0.2
elementType: Cl F F O O O N N N C C C C C C C C C C C C C C C C C C C C C C C C C H H H H H H H H H H H H H H H H H H H H
charge: 0
multiplicity: 1
keywords: wb97x-d3
keywords: def2-TZVPP
keywords: def2/J RIJCOSX
keywords: DEFGRID2
keywords: scfconv7
keywords: smallprint printgap noloewdin
keywords: NOSOSCF
formula: C25H20ClF2N3O3
InChI: InChI=1/C25H20ClF2N3O3/c26-18-10-8-17(9-11-18)23(16-6-7-16)31-34-14-15-4-12-19(13-5-15)29-25(33)30-24(32)22-20(27)2-1-3-21(22)28/h1-5,8-13,16,29-30H,6-7,14H2
54 atoms
Cl -2.786189 -4.453214 3.16742
F  5.782366 1.006002 1.899632
F  5.095617 -0.117766 -2.577776
O  -5.039681 1.005186 0.597419
O  1.855984 3.176977 -1.557953
O  3.289892 -0.040071 0.612579
N  -5.031104 0.656679 -0.740272
N  1.204936 1.534567 -0.107873
N  3.412772 1.728308 -0.818617
C  -4.560879 -0.992173 -2.363885
C  -4.854017 -0.070299 -3.504257
C  -3.439071 -0.440264 -3.215054
C  -4.656946 -0.540233 -0.956674
C  -4.228529 -1.508103 0.079651
C  -5.04419 -1.864512 1.150101
C  -2.965017 -2.084322 -0.027736
C  -4.608501 -2.777987 2.096516
C  -2.509909 -2.984429 0.922037
C  -3.340053 -3.323995 1.978084
C  -4.391538 2.256953 0.751674
C  -2.911612 2.132143 0.525232
C  -2.275388 2.787131 -0.518576
C  -2.147769 1.287635 1.328722
C  -0.161462 1.793345 0.050976
C  -0.915703 2.634879 -0.763149
C  -0.797056 1.120517 1.099262
C  2.091213 2.209345 -0.863515
C  5.392972 0.456424 -0.333993
C  3.929481 0.676961 -0.131081
C  6.272769 0.587482 0.730716
C  5.925746 0.03213 -1.541546
C  7.620716 0.324422 0.616837
C  7.264879 -0.256357 -1.702521
C  8.105678 -0.103263 -0.610691
H  -4.787882 -2.04222 -2.508004
H  -5.177461 0.935621 -3.273521
H  -5.327479 -0.508321 -4.373328
H  -2.930485 -1.126796 -3.879511
H  -2.802548 0.309637 -2.761331
H  -6.037369 -1.446625 1.246031
H  -2.315018 -1.819689 -0.851972
H  -5.25329 -3.055535 2.919459
H  -1.520385 -3.412425 0.834809
H  -4.826158 3.003588 0.078376
H  -4.610648 2.561945 1.776929
H  -2.848665 3.434734 -1.171659
H  -2.610337 0.750261 2.148368
H  -0.47227 3.160915 -1.592787
H  -0.22366 0.460646 1.74031
H  1.578494 0.773806 0.451541
H  4.051057 2.27842 -1.380107
H  8.275392 0.449848 1.468501
H  7.63871 -0.597116 -2.658564
H  9.159292 -0.321967 -0.717566
elementType: Cl F O N C H
totalener: -2014.66207753 hartree
nucrepener: 3458.84318888 hartree
electener: -5473.50526642 hartree
oneelecener: -9637.35459173 hartree
twoeener: 4163.84932532 hartree
cpcmener: -0.03976290 hartree
kineticenergy: 2007.65472716 hartree
xcener: -167.129228971395 hartree
chargesum: 0.0000000
charge: -0.093418 -0.202691 -0.206410 -0.254879 -0.490466 -0.445127 -0.164739 -0.178636 -0.154366 -0.068436 -0.156104 -0.171439 0.218855 0.030478 -0.185955 -0.236583 -0.158929 -0.159490 0.117605 0.101924 -0.015921 -0.179912 -0.203127 0.202059 -0.202284 -0.199398 0.416214 -0.131602 0.393817 0.304686 0.314846 -0.247013 -0.246501 -0.064298 0.110235 0.082665 0.098976 0.098777 0.095871 0.142896 0.157912 0.143195 0.143011 0.094579 0.111625 0.140191 0.139020 0.152301 0.138078 0.199958 0.196146 0.152818 0.152454 0.166531
qa: -0.0934 -0.2027 -0.2064 -0.2549 -0.4905 -0.4451 -0.1647 -0.1786 -0.1544 -0.0684 -0.1561 -0.1714 0.2189 0.0305 -0.1860 -0.2366 -0.1589 -0.1595 0.1176 0.1019 -0.0159 -0.1799 -0.2031 0.2021 -0.2023 -0.1994 0.4162 -0.1316 0.3938 0.3047 0.3148 -0.2470 -0.2465 -0.0643 0.1102 0.0827 0.0990 0.0988 0.0959 0.1429 0.1579 0.1432 0.1430 0.0946 0.1116 0.1402 0.1390 0.1523 0.1381 0.2000 0.1961 0.1528 0.1525 0.1665
va: 1.2119 1.0965 1.0879 1.8990 2.0218 2.0695 2.8786 3.2450 3.2063 3.7596 3.9268 3.9150 3.7539 3.5223 3.9835 3.9751 3.9933 4.0111 3.8261 3.8611 3.5796 3.9511 3.9700 3.7732 3.9517 3.9427 4.3206 3.5512 4.0883 3.9585 3.9386 3.9635 3.9638 3.8079 1.0058 1.0401 1.0160 1.0174 1.0125 1.0148 0.9927 1.0064 1.0074 1.0134 0.9953 1.0050 1.0073 1.0287 1.0094 1.0411 1.0055 1.0007 1.0008 0.9848
dispcorr: -0.028464844 hartree
energy: -2014.690542377643
dipole: -25.95224 28.56671 2.61446 8.78372 -9.43159 -0.64786 -15.21982 14.47227 -0.74755
magnitude: 2.79535 au
magnitude: 7.10521 debye
