program: Orca
programVersion: 5.0.2
elementType: Cl F F O O O N N N C C C C C C C C C C C C C C C C C C C C C C C C C H H H H H H H H H H H H H H H H H H H H
charge: 0
multiplicity: 1
keywords: wb97x-d3
keywords: def2-TZVPP
keywords: def2/J RIJCOSX
keywords: DEFGRID2
keywords: scfconv7
keywords: smallprint printgap noloewdin
keywords: NOSOSCF
formula: C25H20ClF2N3O3
InChI: InChI=1/C25H20ClF2N3O3/c26-18-10-8-17(9-11-18)23(16-6-7-16)31-34-14-15-4-12-19(13-5-15)29-25(33)30-24(32)22-20(27)2-1-3-21(22)28/h1-5,8-13,16,29-30H,6-7,14H2
54 atoms
Cl -6.457223 -1.137992 -5.681916
F  6.697617 -0.534109 -0.769106
F  6.410801 1.501356 3.42629
O  -4.004941 1.125643 -0.308871
O  2.258965 -0.26051 2.999803
O  4.705869 1.443055 0.121969
N  -4.141081 0.079244 0.562169
N  2.19967 1.094481 1.163253
N  4.202222 0.220101 1.97816
C  -4.893625 -2.106221 0.920091
C  -6.111699 -2.982768 0.795228
C  -4.781707 -3.50902 0.385077
C  -4.69734 -0.938102 0.038977
C  -5.136071 -0.98984 -1.378508
C  -4.242794 -1.365712 -2.376359
C  -6.438648 -0.650747 -1.727293
C  -4.643591 -1.416007 -3.702474
C  -6.85298 -0.696109 -3.049871
C  -5.948313 -1.079508 -4.026704
C  -3.339375 2.204574 0.336026
C  -1.88711 1.924206 0.586978
C  -0.940268 2.114634 -0.415548
C  -1.447057 1.436504 1.811117
C  0.825916 1.332923 1.033487
C  0.394614 1.827785 -0.198881
C  -0.111574 1.143424 2.04801
C  2.806934 0.329324 2.090571
C  6.494384 0.472682 1.331375
C  5.055266 0.772885 1.072819
C  7.275274 -0.162032 0.374147
C  7.129593 0.852466 2.505875
C  8.610391 -0.441862 0.573444
C  8.46436 0.605343 2.746332
C  9.195893 -0.052009 1.768956
H  -4.521501 -1.946225 1.925376
H  -6.831822 -2.758566 0.018381
H  -6.550077 -3.338816 1.718631
H  -4.290955 -4.234635 1.020891
H  -4.591585 -3.641491 -0.672762
H  -3.222964 -1.6261 -2.122735
H  -7.144176 -0.346021 -0.964639
H  -3.941852 -1.712627 -4.470293
H  -7.869127 -0.431335 -3.309134
H  -3.456527 3.04587 -0.348794
H  -3.852725 2.459357 1.267959
H  -1.244361 2.497737 -1.382531
H  -2.158288 1.287058 2.614415
H  1.112015 1.986561 -0.995463
H  0.177443 0.784279 3.022279
H  2.789002 1.466305 0.425265
H  4.598754 -0.378481 2.691843
H  9.179574 -0.954971 -0.189952
H  8.920612 0.923117 3.674176
H  10.242802 -0.262106 1.940144
elementType: Cl F O N C H
totalener: -2014.66597259 hartree
nucrepener: 3281.24775229 hartree
electener: -5295.91372488 hartree
oneelecener: -9282.62018688 hartree
twoeener: 3986.70646200 hartree
cpcmener: -0.04220225 hartree
kineticenergy: 2007.65156501 hartree
xcener: -167.128772964197 hartree
chargesum: -0.0000000
charge: -0.095307 -0.201502 -0.206196 -0.226218 -0.492935 -0.447378 -0.149086 -0.182120 -0.156268 -0.067806 -0.167564 -0.167756 0.219700 0.047965 -0.244406 -0.236868 -0.129630 -0.138335 0.088459 0.086552 -0.071618 -0.154005 -0.131440 0.195744 -0.210193 -0.223622 0.419943 -0.124075 0.396495 0.301047 0.305157 -0.242846 -0.240497 -0.064319 0.088193 0.095967 0.100086 0.099792 0.096387 0.148080 0.153888 0.143588 0.142986 0.108261 0.098946 0.142454 0.135961 0.140868 0.151305 0.198710 0.193985 0.152092 0.153102 0.166277
qa: -0.0953 -0.2015 -0.2062 -0.2262 -0.4929 -0.4474 -0.1491 -0.1821 -0.1563 -0.0678 -0.1676 -0.1678 0.2197 0.0480 -0.2444 -0.2369 -0.1296 -0.1383 0.0885 0.0866 -0.0716 -0.1540 -0.1314 0.1957 -0.2102 -0.2236 0.4199 -0.1241 0.3965 0.3010 0.3052 -0.2428 -0.2405 -0.0643 0.0882 0.0960 0.1001 0.0998 0.0964 0.1481 0.1539 0.1436 0.1430 0.1083 0.0989 0.1425 0.1360 0.1409 0.1513 0.1987 0.1940 0.1521 0.1531 0.1663
va: 1.2093 1.0979 1.0884 1.9294 2.0173 2.0643 2.9346 3.2431 3.2009 3.8594 3.8906 3.8901 3.7382 3.4871 4.0084 4.0103 3.9609 3.9732 3.8455 3.8504 3.6627 3.9687 3.9496 3.7735 3.9746 4.0061 4.3189 3.5455 4.0873 3.9615 3.9330 3.9581 3.9624 3.8117 1.0295 1.0158 1.0173 1.0175 1.0147 1.0076 1.0029 1.0043 1.0049 0.9958 1.0090 1.0030 1.0160 1.0077 1.0280 1.0391 1.0079 1.0011 1.0005 0.9850
dispcorr: -0.025129218 hartree
energy: -2014.691101804154
dipole: -25.11657 27.38539 2.26882 -6.41131 5.75217 -0.65914 10.90833 -10.25477 0.65356
magnitude: 2.45136 au
magnitude: 6.23085 debye
