program: Gaussian 09
title: 000055115
version: EM64L-G09RevD.01
frameworkgroup: C1[X(C12H3Cl5O)]
method: RPBEPBE
basis: SDD
operation: Freq
keyword: #p
keyword: freq=noraman
keyword: PBEPBE/SDD
title: #p freq=noraman PBEPBE/SDD
converged: NO NO NO NO
title: Mulliken charges:
elementType: Cl Cl Cl Cl Cl O C C C C C C C C C C C C H H H
charge: -0.019412 0.053085 0.011652 0.005853 0.054587 -0.219246 0.282240 0.395615 0.323893 0.360351 -0.405785 -0.358535 -0.270905 -0.348763 -0.117509 -0.101078 -0.245559 -0.219817 0.295302 0.261424 0.262605
chargesum: 0.00000
title: Mulliken charges with hydrogens summed into heavy atoms:
elementType: Cl Cl Cl Cl Cl O C C C C C C C C C C C C
charge: -0.019412 0.053085 0.011652 0.005853 0.054587 -0.219246 0.282240 0.395615 0.323893 0.360351 -0.110483 -0.358535 -0.270905 -0.348763 -0.117509 -0.101078 0.015866 0.042788
polarizability: 2.87987368e+02 -4.65851609e+00 2.24805956e+02 2.41330815e-03 -1.74339761e-03 6.28855283e+01
1716.lowfreq: -0.0014 -0.0012 0.0021 4.9691 4.9973 7.0881 43.1253 63.2196 89.2705
frequency: 43.1076 63.2162 89.2702 89.4437 92.6533 147.7682 173.6468 183.6141 195.8341 206.2802 226.5689 302.1969 305.7213 318.5602 336.6929 338.9913 362.9263 383.5160 465.5527 491.8428 514.9189 551.4333 565.0845 567.7102 617.5774 632.1915 656.9825 725.8630 727.9227 740.9402 758.1826 802.9330 866.6300 871.4711 886.8704 910.8245 931.6202 1039.9274 1112.5672 1130.8709 1149.7182 1182.7405 1213.3730 1267.5684 1327.5504 1353.2162 1385.3010 1406.8777 1413.1287 1460.6775 1555.6077 1585.5205 1596.4393 1631.3585 3166.3360 3184.2514 3193.8238
redmass: 28.8346 15.1069 20.2649 24.7165 8.5974 32.7051 9.0642 23.4292 25.0724 26.1227 7.8397 17.2214 7.2813 22.1753 23.7951 7.5630 8.4230 10.7761 8.5644 8.7495 5.0263 5.3762 5.2414 10.2112 9.1109 10.0713 8.2068 10.0126 8.9108 10.3825 6.7727 1.3280 8.5861 10.5534 1.4583 9.1751 1.3395 10.2107 2.2649 3.8643 1.9807 3.2142 2.1537 3.3680 4.7184 4.0129 9.1885 6.5166 7.0769 3.4927 9.7397 9.1205 9.9275 10.8144 1.0887 1.0968 1.0935
irintensity: 0.0116 0.0785 0.0130 0.1162 0.9376 0.2160 1.1807 0.0628 0.1101 0.0334 0.0471 1.3040 0.0280 0.7035 1.2649 3.5231 0.4560 0.0854 18.4292 13.2456 0.0904 5.9089 5.7589 7.8720 9.6690 1.3506 14.4423 16.7478 3.3980 35.9253 3.0547 43.4684 43.1438 35.8306 22.2437 74.9619 0.0074 97.4803 17.0020 65.7958 37.7266 32.7043 17.9672 20.1529 43.8674 107.2155 3.1387 45.5717 39.8443 59.6645 28.9766 26.1354 9.0130 1.5527 0.5057 0.1932 2.3855
temp: 298.150 k
press: 1.00000 atm
elementType: 17 17 17 17 17 8 6 6 6 6 6 6 6 6 6 6 6 6 1 1 1
symmnumber: 1
zpe: 296096.2 jmol-1
zpe.correction: 0.112777 hartree
zpe.thermalcorrener: 0.128272 hartree
zpe.thermalcorrenthalpy: 0.129217 hartree
zpe.thermalcorrgfe: 0.068266 hartree
zpe.sumelectzpe: -2833.359853 hartree
zpe.sumelectthermal: -2833.344357 hartree
zpe.sumelectthermalent: -2833.343413 hartree
zpe.sumelectthermalfe: -2833.404364 hartree
dipole: 2.8757 1.7599 0.0002
dipole: 3.3715
quadrupole: -128.5287 -139.7448 -138.1307
quadrupole: 5.2037 0.0003 0.0001
quadrupole: 6.9393 -4.2767 -2.6626 5.2037 0.0003 0.0001
hfenergy: -2833.4726299 hartree
pointgroup: C01 [X(C12H3Cl5O1)]
dipole: 1.155693 0.6510284 0.0000628 debye
dipolederiv: -0.1290436 0.1692601 -0.0000038 -0.0089057 -0.7121771 0.0000066 0. 0.0000052 -0.0355864 -0.0518896 -0.0892272 0.0000046 -0.1697081 -0.6067144 0.0000355 0.0000155 0.0000556 0.0180817 -0.1759695 0.1850135 -0.0000058 0.3156949 -0.631671 0.0000115 -0.0000187 0.0000304 -0.0097028 -0.4591092 0.3036875 -0.000009 0.4063463 -0.3651647 0.0000071 -0.0000072 -0.0000048 -0.0228246 -0.7371093 -0.1767584 -0.0000077 -0.2431606 -0.0516949 -0.0000027 0.0000108 0.0000026 0.0129111 -1.2882507 -0.0471718 -0.000003 -0.0311562 -0.3915227 -0.0000095 0.0000082 -0.0000099 -0.1224637 0.1450258 -0.1363082 -0.0000011 0.2079565 0.0182493 -0.0000027 0.0000015 -0.0000071 0.0101217 0.137949 0.2446407 -0.0000044 -0.2214521 -0.3234133 0.0000019 -0.0000064 -0.0000054 0.0383915 0.6615632 -0.2281076 -0.0000114 -0.6745829 -0.0749176 0.0000278 -0.0000233 0.0000355 0.1144057 0.536958 0.2321756 0.0000081 0.7880452 0.0582864 0.0000134 0.0000141 0.0000235 0.1206591 -0.0848153 0.2122717 0.0000006 -0.003891 -0.1230461 0.0000053 -0.0000005 -0.0000012 -0.0960572 0.2262472 -0.3376 0.000012 0.1021176 1.0746615 -0.0000128 0.0000143 -0.0000133 -0.0776991 -0.1059074 0.2186017 -0.0000102 0.2684046 0.9636807 -0.0000818 -0.0000202 -0.0001003 -0.0609245 0.1868086 -0.3701843 0.0000114 -0.5945654 0.9784633 -0.0000258 0.0000253 -0.000053 -0.1061207 0.4021622 -0.6448683 0.0000121 -0.7646919 0.479391 -0.0000098 0.0000214 -0.0000039 -0.041169 0.8446334 0.3153482 0.000012 0.4872269 -0.1079599 0.0000259 -0.0000138 0.0000241 -0.0453418 -0.129766 0.1368454 0.0000031 0.1119808 -0.2311581 0.0000084 -0.0000007 0.0000056 -0.1075882 -0.1262817 0.0589408 0.0000052 0.0501002 -0.0958661 0.000008 -0.0000002 0.0000135 -0.0992319 0.1174467 -0.0319484 -0.0000014 0.0031399 0.0446194 -0.0000024 -0.0000063 0.0000055 0.1716596 0.0361857 -0.0487335 -0.0000051 -0.0585861 0.0166823 -0.0000034 -0.0000046 -0.0000032 0.1703589 -0.0068377 0.0341227 -0.0000062 0.0296874 0.0812721 -0.0000002 -0.0000093 0.0000004 0.1681206 unknown
polarizability: 287.568223|-6.9287992|225.2251005|0.0023487|-0.0018295|62.8855283 unknown
InChI: InChI=1S/C12H3Cl5O/c13-5-1-2-6(14)12-8(5)4-3-7(15)9(16)10(17)11(4)18-12/h1-3H
charge 0 multiplicity 1
21 atoms
Cl 1.631586 3.398997 -0.00003
Cl -2.277811 -3.046968 0.000104
Cl 3.460753 -2.802975 0.000028
Cl -4.004374 2.301302 -0.000076
Cl -4.710177 -0.862825 -0.000074
O  0.513167 -1.623218 -0.000072
C  -0.310072 0.578719 -0.000034
C  1.150381 0.637175 -0.000029
C  -0.639196 -0.808045 -0.000054
C  1.599109 -0.719541 -0.000049
C  -1.347987 1.535282 -0.000002
C  2.127804 1.654319 -0.000009
C  -1.957393 -1.280207 -0.000041
C  2.954216 -1.0729 -0.000031
C  -2.676217 1.071766 -0.00006
C  -2.995594 -0.316818 -0.000076
C  3.495931 1.325449 0.000027
C  3.90632 -0.033437 0.00002
H  -1.14009 2.606705 0.000027
H  4.24915 2.117874 0.000066
H  4.972094 -0.278654 0.000065
