program: Orca
programVersion: 5.0.2
elementType: Cl F F O O O N N N C C C C C C C C C C C C C C C C C C C C C C C C C H H H H H H H H H H H H H H H H H H H H
charge: 0
multiplicity: 1
keywords: wb97x-d3
keywords: def2-TZVPP
keywords: def2/J RIJCOSX
keywords: DEFGRID2
keywords: scfconv7
keywords: smallprint printgap noloewdin
keywords: NOSOSCF
formula: C25H20ClF2N3O3
InChI: InChI=1/C25H20ClF2N3O3/c26-18-10-8-17(9-11-18)23(16-6-7-16)31-34-14-15-4-12-19(13-5-15)29-25(33)30-24(32)22-20(27)2-1-3-21(22)28/h1-5,8-13,16,29-30H,6-7,14H2
54 atoms
Cl -7.270703 -2.162374 -5.332833
F  6.008211 -1.952845 2.021227
F  6.895636 2.456162 0.759515
O  -3.967785 0.96584 -0.714627
O  2.736655 2.826501 2.570524
O  4.363242 -0.234041 0.305186
N  -3.922027 -0.03131 0.220842
N  2.222774 1.339778 0.914526
N  4.356152 1.446179 1.844211
C  -4.515398 -2.215841 0.867181
C  -3.505294 -2.264217 1.978817
C  -4.920531 -1.933846 2.293306
C  -4.488912 -1.11492 -0.130666
C  -5.151745 -1.358921 -1.433315
C  -4.528935 -1.083282 -2.649816
C  -6.433793 -1.904787 -1.447339
C  -5.173229 -1.338486 -3.84908
C  -7.095959 -2.149919 -2.639589
C  -6.456963 -1.86113 -3.834451
C  -3.325107 2.119779 -0.212786
C  -1.866646 1.915551 0.090876
C  -1.266643 2.617758 1.125871
C  -1.070765 1.049602 -0.654259
C  0.866268 1.60044 0.687247
C  0.081545 2.481104 1.428576
C  0.269587 0.891354 -0.358881
C  3.03754 1.929316 1.808912
C  6.397143 0.266089 1.400638
C  4.944336 0.45841 1.116362
C  6.882489 -0.966383 1.818004
C  7.332024 1.271164 1.196434
C  8.221768 -1.196827 2.049025
C  8.682502 1.085732 1.403205
C  9.116258 -0.158384 1.834853
H  -4.82636 -3.170528 0.462165
H  -2.77349 -1.467556 2.016568
H  -3.129453 -3.240137 2.257728
H  -5.52821 -2.674039 2.797923
H  -5.159841 -0.905884 2.535766
H  -3.523476 -0.686583 -2.678481
H  -6.936376 -2.133916 -0.515891
H  -4.674774 -1.12724 -4.785611
H  -8.096159 -2.561411 -2.630162
H  -3.453696 2.865361 -1.001294
H  -3.844219 2.494972 0.675883
H  -1.862491 3.293613 1.728741
H  -1.490256 0.480165 -1.474395
H  0.490342 3.050801 2.246394
H  0.864627 0.201962 -0.947098
H  2.627505 0.595892 0.355099
H  4.919933 1.913753 2.543049
H  8.557403 -2.167308 2.388874
H  9.378723 1.893903 1.224919
H  10.171192 -0.32295 2.006366
elementType: Cl F O N C H
totalener: -2014.66407242 hartree
nucrepener: 3279.61065315 hartree
electener: -5294.27472558 hartree
oneelecener: -9279.10909477 hartree
twoeener: 3984.83436919 hartree
cpcmener: -0.04048168 hartree
kineticenergy: 2007.64424625 hartree
xcener: -167.131783753838 hartree
chargesum: -0.0000000
charge: -0.093559 -0.201184 -0.206000 -0.240486 -0.494986 -0.447236 -0.184596 -0.175134 -0.155240 -0.105270 -0.168269 -0.144411 0.231566 0.049521 -0.196028 -0.219672 -0.165752 -0.165538 0.118056 0.090165 -0.033351 -0.147998 -0.181226 0.187305 -0.222790 -0.212664 0.418287 -0.127862 0.398491 0.300732 0.304864 -0.240770 -0.240036 -0.065003 0.113504 0.086836 0.098491 0.095315 0.087045 0.162420 0.154956 0.139265 0.143089 0.105627 0.098673 0.138759 0.155847 0.156898 0.136778 0.198185 0.193171 0.151701 0.153248 0.166263
qa: -0.0936 -0.2012 -0.2060 -0.2405 -0.4950 -0.4472 -0.1846 -0.1751 -0.1552 -0.1053 -0.1683 -0.1444 0.2316 0.0495 -0.1960 -0.2197 -0.1658 -0.1655 0.1181 0.0902 -0.0334 -0.1480 -0.1812 0.1873 -0.2228 -0.2127 0.4183 -0.1279 0.3985 0.3007 0.3049 -0.2408 -0.2400 -0.0650 0.1135 0.0868 0.0985 0.0953 0.0870 0.1624 0.1550 0.1393 0.1431 0.1056 0.0987 0.1388 0.1558 0.1569 0.1368 0.1982 0.1932 0.1517 0.1532 0.1663
va: 1.2117 1.0983 1.0887 1.9512 2.0167 2.0664 2.8611 3.2538 3.2068 3.7809 3.9378 3.9005 3.6892 3.5582 3.9933 4.0206 4.0269 3.9985 3.8263 3.8625 3.6547 3.9873 3.9521 3.8039 3.9746 3.9944 4.3180 3.5493 4.0829 3.9619 3.9330 3.9581 3.9610 3.8122 1.0023 1.0307 1.0154 1.0189 1.0284 0.9967 0.9963 1.0101 1.0071 0.9920 1.0085 1.0018 0.9971 1.0306 1.0107 1.0398 1.0084 1.0012 1.0004 0.9850
dispcorr: -0.025000645 hartree
energy: -2014.689073066868
dipole: -19.57239 21.84068 2.26829 -1.01310 0.19167 -0.82143 13.39410 -12.62029 0.77381
magnitude: 2.53351 au
magnitude: 6.43967 debye
