program: Orca
programVersion: 5.0.2
elementType: Cl F F O O O N N N C C C C C C C C C C C C C C C C C C C C C C C C C H H H H H H H H H H H H H H H H H H H H
charge: 0
multiplicity: 1
keywords: wb97x-d3
keywords: def2-TZVPP
keywords: def2/J RIJCOSX
keywords: DEFGRID2
keywords: scfconv7
keywords: smallprint printgap noloewdin
keywords: NOSOSCF
formula: C25H20ClF2N3O3
InChI: InChI=1/C25H20ClF2N3O3/c26-18-10-8-17(9-11-18)23(16-6-7-16)31-34-14-15-4-12-19(13-5-15)29-25(33)30-24(32)22-20(27)2-1-3-21(22)28/h1-5,8-13,16,29-30H,6-7,14H2
54 atoms
Cl -5.587067 -0.766443 -5.904625
F  5.766199 -1.844198 2.839244
F  6.587469 2.194812 0.636188
O  -4.352469 1.033188 0.155717
O  2.57825 1.089339 -1.101589
O  4.000986 0.446752 2.730232
N  -4.352923 -0.189755 0.7745
N  1.9245 1.039685 1.087337
N  4.126517 0.620902 0.461569
C  -4.862484 -2.493709 0.585805
C  -4.713982 -2.7449 2.052854
C  -6.077169 -2.749948 1.447845
C  -4.672188 -1.147001 0.000377
C  -4.903224 -1.017682 -1.458441
C  -3.898398 -0.55173 -2.303415
C  -6.117922 -1.4143 -2.008848
C  -4.100612 -0.480846 -3.671319
C  -6.339695 -1.332296 -3.375396
C  -5.325672 -0.865532 -4.195202
C  -3.698198 1.991242 0.973585
C  -2.213749 1.78073 1.004534
C  -1.432461 2.103761 -0.099665
C  -1.585165 1.209949 2.104972
C  0.552881 1.297156 0.987476
C  -0.065377 1.87556 -0.121428
C  -0.22208 0.973424 2.101625
C  2.812253 0.937795 0.080292
C  6.120545 0.179686 1.726248
C  4.65025 0.431486 1.702939
C  6.629646 -0.954669 2.346208
C  7.044703 1.080912 1.215101
C  7.981881 -1.203708 2.442909
C  8.406254 0.882471 1.300357
C  8.864472 -0.271087 1.917411
H  -4.582893 -3.303161 -0.078911
H  -4.438734 -1.91397 2.688102
H  -4.280326 -3.693966 2.340868
H  -6.591431 -3.694165 1.322604
H  -6.722795 -1.904915 1.652601
H  -2.937527 -0.258777 -1.900112
H  -6.909526 -1.785265 -1.370011
H  -3.309221 -0.127334 -4.318463
H  -7.292254 -1.633137 -3.790224
H  -3.945406 2.952831 0.520355
H  -4.116733 1.978907 1.984547
H  -1.894818 2.555416 -0.970026
H  -2.164961 0.943566 2.9805
H  0.499286 2.161611 -0.994099
H  0.245798 0.525157 2.970539
H  2.269049 0.817574 2.016198
H  4.746571 0.520562 -0.332487
H  8.337174 -2.106948 2.920075
H  9.090501 1.616657 0.896838
H  9.929006 -0.44645 1.990837
elementType: Cl F O N C H
totalener: -2014.66553849 hartree
nucrepener: 3313.03875249 hartree
electener: -5327.70429098 hartree
oneelecener: -9346.17154628 hartree
twoeener: 4018.46725530 hartree
cpcmener: -0.04050591 hartree
kineticenergy: 2007.65781742 hartree
xcener: -167.129665722004 hartree
chargesum: 0.0000000
charge: -0.095260 -0.201179 -0.206021 -0.234526 -0.492681 -0.447332 -0.178162 -0.183881 -0.156280 -0.100796 -0.159716 -0.167085 0.249826 0.027151 -0.202468 -0.209786 -0.165006 -0.162057 0.112779 0.092867 -0.054617 -0.195993 -0.131580 0.194986 -0.196842 -0.219930 0.418339 -0.128316 0.400774 0.300221 0.304794 -0.240964 -0.240540 -0.064260 0.113141 0.084565 0.099666 0.095019 0.092880 0.155203 0.157336 0.142242 0.142606 0.111559 0.097043 0.143038 0.142090 0.151742 0.139536 0.200371 0.193102 0.152384 0.153316 0.166696
qa: -0.0953 -0.2012 -0.2060 -0.2345 -0.4927 -0.4473 -0.1782 -0.1839 -0.1563 -0.1008 -0.1597 -0.1671 0.2498 0.0272 -0.2025 -0.2098 -0.1650 -0.1621 0.1128 0.0929 -0.0546 -0.1960 -0.1316 0.1950 -0.1968 -0.2199 0.4183 -0.1283 0.4008 0.3002 0.3048 -0.2410 -0.2405 -0.0643 0.1131 0.0846 0.0997 0.0950 0.0929 0.1552 0.1573 0.1422 0.1426 0.1116 0.0970 0.1430 0.1421 0.1517 0.1395 0.2004 0.1931 0.1524 0.1533 0.1667
va: 1.2096 1.0983 1.0888 1.9317 2.0183 2.0653 2.8939 3.2412 3.2065 3.7944 3.9248 3.9174 3.7382 3.5745 4.0104 4.0012 4.0130 4.0062 3.8258 3.8562 3.6290 3.9821 3.9325 3.7730 3.9790 3.9978 4.3217 3.5465 4.0829 3.9594 3.9354 3.9573 3.9605 3.8126 1.0051 1.0362 1.0154 1.0179 1.0189 0.9993 0.9938 1.0075 1.0078 0.9949 1.0108 1.0060 1.0050 1.0271 1.0087 1.0404 1.0086 1.0009 1.0006 0.9848
dispcorr: -0.025500017 hartree
energy: -2014.691038504326
dipole: -26.02418 28.32872 2.30453 -5.77168 4.86737 -0.90431 14.31455 -13.23899 1.07557
magnitude: 2.69917 au
magnitude: 6.86073 debye
