program: Orca
programVersion: 5.0.2
elementType: Cl F F O O O N N N C C C C C C C C C C C C C C C C C C C C C C C C C H H H H H H H H H H H H H H H H H H H H
charge: 0
multiplicity: 1
keywords: wb97x-d3
keywords: def2-TZVPP
keywords: def2/J RIJCOSX
keywords: DEFGRID2
keywords: scfconv7
keywords: smallprint printgap noloewdin
keywords: NOSOSCF
formula: C25H20ClF2N3O3
InChI: InChI=1/C25H20ClF2N3O3/c26-18-10-8-17(9-11-18)23(16-6-7-16)31-34-14-15-4-12-19(13-5-15)29-25(33)30-24(32)22-20(27)2-1-3-21(22)28/h1-5,8-13,16,29-30H,6-7,14H2
54 atoms
Cl -8.043211 -4.380102 1.30133
F  6.246686 -1.420065 -0.586776
F  6.748017 2.598666 1.733547
O  -4.092779 0.667008 0.306556
O  2.919907 3.277646 -0.742455
O  4.290081 -0.113434 1.202412
N  -3.721017 0.384774 -0.978359
N  2.209706 1.505932 0.51469
N  4.459172 1.819124 0.005093
C  -3.903231 -0.995172 -2.875475
C  -3.976313 0.075349 -3.93701
C  -2.653584 -0.449828 -3.506315
C  -4.237953 -0.670645 -1.464326
C  -5.162592 -1.584499 -0.753755
C  -6.356632 -1.953915 -1.369659
C  -4.867434 -2.109295 0.503474
C  -7.251115 -2.80752 -0.743866
C  -5.745321 -2.976038 1.133478
C  -6.936389 -3.310487 0.508046
C  -3.481629 1.878219 0.718627
C  -1.982136 1.81741 0.677011
C  -1.245329 2.805663 0.043076
C  -1.290339 0.75572 1.255183
C  0.822332 1.685836 0.538915
C  0.14148 2.761573 -0.026106
C  0.086521 0.687754 1.185296
C  3.130956 2.264404 -0.107166
C  6.448353 0.605875 0.554751
C  4.962506 0.723061 0.633381
C  7.041624 -0.495626 -0.04583
C  7.297409 1.549075 1.114847
C  8.408951 -0.652007 -0.122607
C  8.670445 1.431186 1.074593
C  9.216324 0.323412 0.443945
H  -4.198255 -1.990922 -3.181655
H  -4.259601 1.067529 -3.608407
H  -4.357683 -0.208053 -4.90973
H  -2.115965 -1.106031 -4.17862
H  -2.026957 0.184931 -2.892736
H  -6.605404 -1.565033 -2.349227
H  -3.936849 -1.865501 0.997301
H  -8.178898 -3.074355 -1.231609
H  -5.500003 -3.382335 2.105484
H  -3.843285 2.716585 0.113929
H  -3.842864 2.029599 1.738138
H  -1.758165 3.639633 -0.421922
H  -1.827723 -0.036861 1.762194
H  0.663742 3.558081 -0.529471
H  0.602268 -0.153968 1.632864
H  2.555385 0.673348 0.981823
H  5.110225 2.415261 -0.490352
H  8.832058 -1.517281 -0.614735
H  9.297149 2.186684 1.528736
H  10.291236 0.215524 0.396534
elementType: Cl F O N C H
totalener: -2014.66418008 hartree
nucrepener: 3289.57746907 hartree
electener: -5304.24164915 hartree
oneelecener: -9299.14319511 hartree
twoeener: 3994.90154596 hartree
cpcmener: -0.04042134 hartree
kineticenergy: 2007.65842025 hartree
xcener: -167.132901940523 hartree
chargesum: -0.0000000
charge: -0.093921 -0.201724 -0.206285 -0.239162 -0.493497 -0.446284 -0.183622 -0.173482 -0.154778 -0.106509 -0.145937 -0.166079 0.234053 0.061700 -0.228914 -0.202238 -0.160558 -0.159395 0.110387 0.097554 -0.028518 -0.157593 -0.184831 0.184846 -0.217010 -0.205788 0.418609 -0.126728 0.394284 0.302365 0.308605 -0.244412 -0.242710 -0.064425 0.113078 0.086841 0.095423 0.098476 0.085959 0.155269 0.151983 0.143424 0.142114 0.096866 0.108926 0.139611 0.143954 0.155768 0.140203 0.197679 0.194068 0.152220 0.153340 0.166796
qa: -0.0939 -0.2017 -0.2063 -0.2392 -0.4935 -0.4463 -0.1836 -0.1735 -0.1548 -0.1065 -0.1459 -0.1661 0.2341 0.0617 -0.2289 -0.2022 -0.1606 -0.1594 0.1104 0.0976 -0.0285 -0.1576 -0.1848 0.1848 -0.2170 -0.2058 0.4186 -0.1267 0.3943 0.3024 0.3086 -0.2444 -0.2427 -0.0644 0.1131 0.0868 0.0954 0.0985 0.0860 0.1553 0.1520 0.1434 0.1421 0.0969 0.1089 0.1396 0.1440 0.1558 0.1402 0.1977 0.1941 0.1522 0.1533 0.1668
va: 1.2114 1.0977 1.0884 1.9410 2.0186 2.0674 2.8670 3.2546 3.2061 3.7753 3.9005 3.9376 3.6973 3.5340 4.0224 4.0083 3.9952 4.0087 3.8360 3.8511 3.6500 3.9882 3.9713 3.8197 3.9693 3.9725 4.3164 3.5476 4.0845 3.9612 3.9331 3.9614 3.9629 3.8110 1.0028 1.0285 1.0187 1.0155 1.0293 0.9967 1.0048 1.0069 1.0077 1.0068 0.9936 1.0028 1.0078 1.0316 1.0085 1.0413 1.0075 1.0011 1.0005 0.9848
dispcorr: -0.025105205 hartree
energy: -2014.689285281068
dipole: -15.45378 17.97002 2.51625 8.40037 -8.72708 -0.32671 -15.32110 14.80577 -0.51534
magnitude: 2.58917 au
magnitude: 6.58115 debye
