program: Orca
programVersion: 5.0.2
elementType: Cl F F O O O N N N C C C C C C C C C C C C C C C C C C C C C C C C C H H H H H H H H H H H H H H H H H H H H
charge: 0
multiplicity: 1
keywords: wb97x-d3
keywords: def2-TZVPP
keywords: def2/J RIJCOSX
keywords: DEFGRID2
keywords: scfconv7
keywords: smallprint printgap noloewdin
keywords: NOSOSCF
formula: C25H20ClF2N3O3
InChI: InChI=1/C25H20ClF2N3O3/c26-18-10-8-17(9-11-18)23(16-6-7-16)31-34-14-15-4-12-19(13-5-15)29-25(33)30-24(32)22-20(27)2-1-3-21(22)28/h1-5,8-13,16,29-30H,6-7,14H2
54 atoms
Cl -5.243739 -1.791297 -5.841225
F  5.996375 -0.071801 3.82014
F  6.361075 0.443993 -0.809881
O  -4.307739 0.998872 0.001913
O  2.872727 3.231662 0.191203
O  3.877708 -0.413504 1.864045
N  -4.451277 -0.130879 0.75743
N  1.963788 1.303351 1.014271
N  4.268043 1.618096 0.910532
C  -5.091343 -2.394776 0.8727
C  -5.118747 -2.391981 2.368085
C  -6.405051 -2.463514 1.616839
C  -4.770396 -1.171618 0.09762
C  -4.885681 -1.27185 -1.376034
C  -3.879048 -0.816146 -2.226798
C  -5.998667 -1.898954 -1.932607
C  -3.981195 -0.980629 -3.59793
C  -6.121381 -2.053903 -3.304136
C  -5.107389 -1.592317 -4.127196
C  -3.695413 2.025925 0.771315
C  -2.202703 1.873972 0.846746
C  -1.614563 0.905397 1.658826
C  -1.364684 2.673932 0.080152
C  0.590857 1.561069 0.922826
C  -0.242762 0.747437 1.693839
C  0.016588 2.535252 0.109336
C  2.976607 2.122811 0.674405
C  6.12409 0.207119 1.504414
C  4.648858 0.427135 1.444841
C  6.740587 -0.089497 2.713505
C  6.928182 0.190283 0.37307
C  8.085599 -0.373772 2.812578
C  8.275068 -0.101127 0.419828
C  8.845477 -0.380017 1.652102
H  -4.777309 -3.314011 0.391171
H  -4.876915 -1.471472 2.881496
H  -4.767869 -3.288484 2.862517
H  -6.946907 -3.400393 1.59423
H  -7.029019 -1.578562 1.597357
H  -2.989388 -0.350742 -1.825418
H  -6.789753 -2.268667 -1.292652
H  -3.18666 -0.634035 -4.245073
H  -6.996814 -2.533293 -3.721129
H  -3.955796 2.95647 0.264648
H  -4.141754 2.051996 1.769486
H  -2.232233 0.267207 2.277891
H  -1.793339 3.433781 -0.562991
H  0.192899 -0.011902 2.333012
H  0.621312 3.177594 -0.510329
H  2.220173 0.435008 1.473666
H  4.995771 2.278167 0.665608
H  8.527368 -0.586336 3.776754
H  8.860784 -0.11489 -0.489258
H  9.900989 -0.607643 1.709369
elementType: Cl F O N C H
totalener: -2014.66465182 hartree
nucrepener: 3295.73341758 hartree
electener: -5310.39806940 hartree
oneelecener: -9311.29782662 hartree
twoeener: 4000.89975722 hartree
cpcmener: -0.03921293 hartree
kineticenergy: 2007.64574353 hartree
xcener: -167.129164753192 hartree
chargesum: -0.0000000
charge: -0.093612 -0.201478 -0.206255 -0.236062 -0.491264 -0.447335 -0.177926 -0.183115 -0.156692 -0.096987 -0.164908 -0.169972 0.242119 0.026819 -0.186795 -0.219070 -0.169707 -0.162223 0.117679 0.095339 -0.087886 -0.123937 -0.147141 0.198920 -0.226724 -0.208483 0.416633 -0.128879 0.399816 0.301022 0.305984 -0.241444 -0.241039 -0.064811 0.115104 0.085862 0.099364 0.094711 0.093697 0.146028 0.161566 0.142326 0.141788 0.103722 0.101835 0.144311 0.141568 0.139853 0.150496 0.200305 0.194677 0.152756 0.152633 0.166813
qa: -0.0936 -0.2015 -0.2063 -0.2361 -0.4913 -0.4473 -0.1779 -0.1831 -0.1567 -0.0970 -0.1649 -0.1700 0.2421 0.0268 -0.1868 -0.2191 -0.1697 -0.1622 0.1177 0.0953 -0.0879 -0.1239 -0.1471 0.1989 -0.2267 -0.2085 0.4166 -0.1289 0.3998 0.3010 0.3060 -0.2414 -0.2410 -0.0648 0.1151 0.0859 0.0994 0.0947 0.0937 0.1460 0.1616 0.1423 0.1418 0.1037 0.1018 0.1443 0.1416 0.1399 0.1505 0.2003 0.1947 0.1528 0.1526 0.1668
va: 1.2116 1.0978 1.0885 1.9390 2.0205 2.0659 2.8835 3.2411 3.2057 3.8042 3.9281 3.9165 3.7327 3.5837 4.0115 4.0082 4.0141 4.0168 3.8245 3.8356 3.6586 3.9005 3.9825 3.7640 4.0095 3.9878 4.3231 3.5458 4.0852 3.9575 3.9359 3.9585 3.9584 3.8116 1.0033 1.0359 1.0150 1.0181 1.0168 1.0056 0.9897 1.0075 1.0086 0.9990 1.0135 1.0116 1.0026 1.0094 1.0273 1.0406 1.0073 1.0008 1.0008 0.9848
dispcorr: -0.025186169 hartree
energy: -2014.689837986472
dipole: -27.98938 30.16126 2.17188 -3.26505 2.22673 -1.03832 15.22402 -14.27565 0.94836
magnitude: 2.58738 au
magnitude: 6.57661 debye
