program: Orca
programVersion: 5.0.2
elementType: Cl F F O O O N N N C C C C C C C C C C C C C C C C C C C C C C C C C H H H H H H H H H H H H H H H H H H H H
charge: 0
multiplicity: 1
keywords: wb97x-d3
keywords: def2-TZVPP
keywords: def2/J RIJCOSX
keywords: DEFGRID2
keywords: scfconv7
keywords: smallprint printgap noloewdin
keywords: NOSOSCF
formula: C25H20ClF2N3O3
InChI: InChI=1/C25H20ClF2N3O3/c26-18-10-8-17(9-11-18)23(16-6-7-16)31-34-14-15-4-12-19(13-5-15)29-25(33)30-24(32)22-20(27)2-1-3-21(22)28/h1-5,8-13,16,29-30H,6-7,14H2
54 atoms
Cl -7.877778 -1.304139 3.671625
F  5.706417 -1.442836 1.415306
F  7.22487 1.755452 -1.633965
O  -4.088529 1.136865 -1.019572
O  2.51603 1.753409 1.776522
O  4.577992 0.458847 -1.576944
N  -3.807891 -0.030965 -1.671224
N  2.233178 1.279477 -0.441719
N  4.29469 1.02668 0.611799
C  -3.973326 -2.380686 -1.732753
C  -3.058513 -2.486684 -2.911289
C  -2.564422 -2.901877 -1.568344
C  -4.317893 -1.066916 -1.138293
C  -5.193321 -1.083001 0.056269
C  -6.343067 -0.298939 0.13418
C  -4.891877 -1.939043 1.112931
C  -7.174609 -0.368598 1.239959
C  -5.705031 -2.004544 2.233295
C  -6.844266 -1.217917 2.284548
C  -3.290348 2.180378 -1.562552
C  -1.834055 1.988563 -1.258358
C  -0.933066 1.600984 -2.243082
C  -1.356025 2.134439 0.038683
C  0.871937 1.534973 -0.639249
C  0.399647 1.382126 -1.944131
C  -0.024989 1.917037 0.35968
C  2.93971 1.386825 0.699055
C  6.41452 0.17842 -0.113888
C  5.010169 0.559579 -0.446098
C  6.717171 -0.826407 0.794689
C  7.484615 0.779799 -0.762633
C  8.010535 -1.221104 1.063829
C  8.79452 0.426495 -0.520023
C  9.045647 -0.581519 0.399053
H  -4.76093 -3.12094 -1.657084
H  -2.672244 -1.57152 -3.33854
H  -3.2823 -3.261109 -3.633215
H  -2.438795 -3.956452 -1.36062
H  -1.856617 -2.253198 -1.067692
H  -6.617331 0.357364 -0.680712
H  -4.006344 -2.560598 1.072722
H  -8.071403 0.234629 1.281989
H  -5.450563 -2.665456 3.050791
H  -3.454775 2.263853 -2.641133
H  -3.672911 3.088929 -1.094358
H  -1.272461 1.468285 -3.263434
H  -2.034088 2.429511 0.831179
H  1.08093 1.082708 -2.732146
H  0.293294 2.047682 1.380547
H  2.750681 0.984201 -1.263823
H  4.780061 1.134184 1.493746
H  8.202335 -2.013167 1.774758
H  9.599868 0.929651 -1.037854
H  10.067049 -0.874468 0.599414
elementType: Cl F O N C H
totalener: -2014.66556233 hartree
nucrepener: 3314.95509665 hartree
electener: -5329.62065897 hartree
oneelecener: -9349.98789152 hartree
twoeener: 4020.36723255 hartree
cpcmener: -0.03992126 hartree
kineticenergy: 2007.66546854 hartree
xcener: -167.132642054596 hartree
chargesum: -0.0000000
charge: -0.094315 -0.206043 -0.201311 -0.237140 -0.493235 -0.447029 -0.166685 -0.171760 -0.154679 -0.100102 -0.155916 -0.166942 0.243117 0.014692 -0.181614 -0.209636 -0.170978 -0.167983 0.119452 0.094912 -0.058322 -0.144174 -0.167103 0.192171 -0.218638 -0.216463 0.418365 -0.127609 0.396995 0.303162 0.304404 -0.239186 -0.242291 -0.065591 0.113190 0.081823 0.099062 0.095921 0.092648 0.143762 0.158358 0.141942 0.141937 0.095298 0.111412 0.140672 0.140535 0.140654 0.157820 0.197783 0.193669 0.152759 0.151748 0.166481
qa: -0.0943 -0.2060 -0.2013 -0.2371 -0.4932 -0.4470 -0.1667 -0.1718 -0.1547 -0.1001 -0.1559 -0.1669 0.2431 0.0147 -0.1816 -0.2096 -0.1710 -0.1680 0.1195 0.0949 -0.0583 -0.1442 -0.1671 0.1922 -0.2186 -0.2165 0.4184 -0.1276 0.3970 0.3032 0.3044 -0.2392 -0.2423 -0.0656 0.1132 0.0818 0.0991 0.0959 0.0926 0.1438 0.1584 0.1419 0.1419 0.0953 0.1114 0.1407 0.1405 0.1407 0.1578 0.1978 0.1937 0.1528 0.1517 0.1665
va: 1.2106 1.0887 1.0980 1.9389 2.0186 2.0663 2.9142 3.2540 3.2062 3.7838 3.9254 3.9137 3.7470 3.5831 3.9962 4.0060 4.0066 4.0185 3.8261 3.8577 3.6454 3.9272 3.9963 3.8140 3.9730 3.9676 4.3166 3.5482 4.0841 3.9353 3.9590 3.9598 3.9594 3.8119 1.0043 1.0353 1.0161 1.0183 1.0173 1.0158 0.9922 1.0073 1.0084 1.0087 0.9943 1.0055 1.0088 1.0079 1.0304 1.0402 1.0080 1.0006 1.0012 0.9849
dispcorr: -0.025360022 hartree
energy: -2014.690922347772
dipole: -13.94817 16.58685 2.63868 -4.70585 3.67942 -1.02643 -16.34680 15.97781 -0.36899
magnitude: 2.85523 au
magnitude: 7.25743 debye
