program: Orca
programVersion: 5.0.2
elementType: Cl F F O O O N N N C C C C C C C C C C C C C C C C C C C C C C C C C H H H H H H H H H H H H H H H H H H H H
charge: 0
multiplicity: 1
keywords: wb97x-d3
keywords: def2-TZVPP
keywords: def2/J RIJCOSX
keywords: DEFGRID2
keywords: scfconv7
keywords: smallprint printgap noloewdin
keywords: NOSOSCF
formula: C25H20ClF2N3O3
InChI: InChI=1/C25H20ClF2N3O3/c26-18-10-8-17(9-11-18)23(16-6-7-16)31-34-14-15-4-12-19(13-5-15)29-25(33)30-24(32)22-20(27)2-1-3-21(22)28/h1-5,8-13,16,29-30H,6-7,14H2
54 atoms
Cl -5.921501 -2.481197 -5.502343
F  6.351011 2.12194 2.627099
F  6.010901 -1.561917 -0.224408
O  -4.214968 1.360638 -0.55715
O  2.048173 0.924678 3.254456
O  4.304205 0.797672 -0.211235
N  -4.301228 0.44206 0.451763
N  1.919963 1.254018 0.995564
N  3.90971 0.633709 2.02738
C  -4.646646 -1.790193 1.11391
C  -3.327443 -2.291229 1.655026
C  -4.245662 -1.504662 2.526252
C  -4.633114 -0.728085 0.078527
C  -4.957576 -1.134046 -1.307859
C  -5.871322 -0.427503 -2.088709
C  -4.360809 -2.273749 -1.842915
C  -6.177267 -0.843253 -3.373819
C  -4.645133 -2.691028 -3.133466
C  -5.552641 -1.967744 -3.890155
C  -3.537696 2.514815 -0.080253
C  -2.099298 2.225141 0.231259
C  -1.622288 2.247334 1.53334
C  -1.214647 1.866937 -0.783163
C  0.570429 1.575418 0.816597
C  -0.303523 1.937685 1.83852
C  0.098031 1.54765 -0.498684
C  2.546907 0.951148 2.147479
C  6.131719 0.289436 1.194002
C  4.699776 0.602199 0.92134
C  6.922042 1.077811 2.018615
C  6.753046 -0.778859 0.560719
C  8.264901 0.835334 2.215537
C  8.088493 -1.070176 0.738303
C  8.838081 -0.248662 1.568083
H  -5.41009 -2.545132 0.965565
H  -2.430454 -1.802437 1.295242
H  -3.225837 -3.354899 1.827909
H  -4.786365 -2.029951 3.302808
H  -3.966315 -0.491168 2.779607
H  -6.373763 0.444827 -1.693953
H  -3.653673 -2.844076 -1.254152
H  -6.895297 -0.29062 -3.964623
H  -4.163234 -3.57081 -3.537933
H  -3.627295 3.240217 -0.890977
H  -4.049647 2.925107 0.795557
H  -2.2909 2.516173 2.342488
H  -1.551814 1.833359 -1.812584
H  0.020288 1.984114 2.865271
H  0.768062 1.270296 -1.304287
H  2.473892 1.175059 0.147824
H  4.331318 0.385852 2.913853
H  8.848229 1.481453 2.857638
H  8.532665 -1.921113 0.239911
H  9.888887 -0.458654 1.713613
elementType: Cl F O N C H
totalener: -2014.66557738 hartree
nucrepener: 3328.39441583 hartree
electener: -5343.05999321 hartree
oneelecener: -9376.89432347 hartree
twoeener: 4033.83433026 hartree
cpcmener: -0.04003003 hartree
kineticenergy: 2007.67216934 hartree
xcener: -167.134310865514 hartree
chargesum: -0.0000000
charge: -0.093971 -0.206375 -0.201257 -0.238671 -0.492917 -0.447424 -0.167498 -0.180595 -0.155218 -0.092466 -0.169092 -0.157259 0.235206 0.015434 -0.182252 -0.209836 -0.168114 -0.168248 0.119527 0.097726 -0.048162 -0.152681 -0.169680 0.190642 -0.216606 -0.206861 0.418615 -0.129162 0.399939 0.305964 0.300952 -0.239882 -0.240858 -0.064317 0.113342 0.093264 0.096067 0.098815 0.081856 0.143006 0.159839 0.142210 0.141343 0.112125 0.095092 0.139650 0.140687 0.153223 0.140852 0.199901 0.193310 0.152416 0.152003 0.166396
qa: -0.0940 -0.2064 -0.2013 -0.2387 -0.4929 -0.4474 -0.1675 -0.1806 -0.1552 -0.0925 -0.1691 -0.1573 0.2352 0.0154 -0.1823 -0.2098 -0.1681 -0.1682 0.1195 0.0977 -0.0482 -0.1527 -0.1697 0.1906 -0.2166 -0.2069 0.4186 -0.1292 0.3999 0.3060 0.3010 -0.2399 -0.2409 -0.0643 0.1133 0.0933 0.0961 0.0988 0.0819 0.1430 0.1598 0.1422 0.1413 0.1121 0.0951 0.1397 0.1407 0.1532 0.1409 0.1999 0.1933 0.1524 0.1520 0.1664
va: 1.2113 1.0886 1.0982 1.9375 2.0186 2.0658 2.9160 3.2452 3.2070 3.7829 3.9135 3.9252 3.7499 3.5825 3.9949 4.0065 4.0038 4.0213 3.8267 3.8526 3.6430 3.9509 3.9755 3.7872 3.9877 3.9702 4.3203 3.5452 4.0830 3.9334 3.9586 3.9614 3.9584 3.8112 1.0040 1.0160 1.0180 1.0160 1.0366 1.0179 0.9908 1.0073 1.0087 0.9941 1.0097 1.0062 1.0088 1.0290 1.0080 1.0408 1.0084 1.0008 1.0010 0.9849
dispcorr: -0.025559078 hartree
energy: -2014.691136457464
dipole: -20.30944 22.82005 2.51062 0.89191 -1.57774 -0.68583 14.25524 -13.63746 0.61778
magnitude: 2.67492 au
magnitude: 6.79911 debye
