program: Orca
programVersion: 5.0.2
elementType: Cl F F O O O N N N C C C C C C C C C C C C C C C C C C C C C C C C C H H H H H H H H H H H H H H H H H H H H
charge: 0
multiplicity: 1
keywords: wb97x-d3
keywords: def2-TZVPP
keywords: def2/J RIJCOSX
keywords: DEFGRID2
keywords: scfconv7
keywords: smallprint printgap noloewdin
keywords: NOSOSCF
formula: C25H20ClF2N3O3
InChI: InChI=1/C25H20ClF2N3O3/c26-18-10-8-17(9-11-18)23(16-6-7-16)31-34-14-15-4-12-19(13-5-15)29-25(33)30-24(32)22-20(27)2-1-3-21(22)28/h1-5,8-13,16,29-30H,6-7,14H2
54 atoms
Cl -7.233419 -1.589851 3.956349
F  5.672626 -1.887212 0.457762
F  7.043325 2.390301 -0.820545
O  -4.271369 1.282061 -1.073815
O  2.149026 0.556367 1.82387
O  4.535614 1.064217 -1.519873
N  -3.992499 0.155958 -1.804367
N  2.072544 1.193145 -0.36952
N  4.068111 0.561933 0.652452
C  -4.018443 -2.195043 -1.955867
C  -3.229431 -2.197037 -3.226801
C  -2.568914 -2.624656 -1.961124
C  -4.375483 -0.931381 -1.266216
C  -5.091197 -1.056025 0.024087
C  -4.622311 -1.963022 0.972447
C  -6.242641 -0.324114 0.30906
C  -5.269515 -2.126445 2.186422
C  -6.909271 -0.490754 1.512124
C  -6.411324 -1.386195 2.44595
C  -3.412383 2.326762 -1.495265
C  -1.972654 2.039919 -1.172553
C  -0.971651 2.218998 -2.118902
C  -1.604107 1.565943 0.081543
C  0.712558 1.462343 -0.561294
C  0.351006 1.943136 -1.820054
C  -0.286087 1.274551 0.39627
C  2.681469 0.76887 0.753086
C  6.304408 0.272312 -0.167953
C  4.889576 0.669997 -0.426453
C  6.65349 -1.002813 0.254313
C  7.346204 1.158353 -0.410134
C  7.961916 -1.392929 0.446088
C  8.668567 0.820506 -0.217214
C  8.965076 -0.464948 0.211204
H  -4.744752 -2.989891 -1.830437
H  -2.949129 -1.24339 -3.653179
H  -3.47977 -2.95936 -3.953166
H  -2.355028 -3.675174 -1.810697
H  -1.855216 -1.946467 -1.509203
H  -3.73323 -2.547528 0.772733
H  -6.648118 0.368283 -0.41612
H  -4.885012 -2.825711 2.916523
H  -7.807993 0.07602 1.715039
H  -3.533728 2.519456 -2.566358
H  -3.767628 3.209118 -0.958352
H  -1.222588 2.574201 -3.111433
H  -2.358463 1.405468 0.842966
H  1.110553 2.090905 -2.579134
H  -0.057184 0.9026 1.381087
H  2.671916 1.342783 -1.175566
H  4.481397 0.279457 1.532567
H  8.190158 -2.399887 0.768352
H  9.448752 1.547023 -0.399612
H  9.997408 -0.749187 0.362403
elementType: Cl F O N C H
totalener: -2014.66493295 hartree
nucrepener: 3342.27934908 hartree
electener: -5356.94428203 hartree
oneelecener: -9404.63487576 hartree
twoeener: 4047.69059373 hartree
cpcmener: -0.03949016 hartree
kineticenergy: 2007.65040786 hartree
xcener: -167.131007483513 hartree
chargesum: -0.0000000
charge: -0.093354 -0.206065 -0.200939 -0.241577 -0.494168 -0.447827 -0.171144 -0.172652 -0.154855 -0.082944 -0.160234 -0.166774 0.221990 0.018498 -0.212201 -0.180123 -0.168381 -0.168246 0.120115 0.115239 -0.021316 -0.155620 -0.204393 0.181412 -0.205022 -0.206001 0.418445 -0.129129 0.399108 0.305687 0.300227 -0.240156 -0.240513 -0.064832 0.113554 0.083471 0.098992 0.096109 0.093119 0.159298 0.143073 0.141793 0.142884 0.093472 0.108440 0.140837 0.133321 0.140070 0.156703 0.197841 0.192493 0.152986 0.152398 0.166891
qa: -0.0934 -0.2061 -0.2009 -0.2416 -0.4942 -0.4478 -0.1711 -0.1727 -0.1549 -0.0829 -0.1602 -0.1668 0.2220 0.0185 -0.2122 -0.1801 -0.1684 -0.1682 0.1201 0.1152 -0.0213 -0.1556 -0.2044 0.1814 -0.2050 -0.2060 0.4184 -0.1291 0.3991 0.3057 0.3002 -0.2402 -0.2405 -0.0648 0.1136 0.0835 0.0990 0.0961 0.0931 0.1593 0.1431 0.1418 0.1429 0.0935 0.1084 0.1408 0.1333 0.1401 0.1567 0.1978 0.1925 0.1530 0.1524 0.1669
va: 1.2119 1.0886 1.0985 1.9358 2.0180 2.0653 2.9041 3.2534 3.2085 3.7755 3.9264 3.9144 3.7465 3.5610 4.0012 3.9909 4.0223 4.0018 3.8267 3.8313 3.6358 3.9675 3.9892 3.8246 3.9540 3.9645 4.3178 3.5504 4.0813 3.9338 3.9618 3.9606 3.9591 3.8118 1.0036 1.0387 1.0157 1.0179 1.0158 0.9910 1.0178 1.0085 1.0068 1.0132 0.9942 1.0016 1.0182 1.0078 1.0311 1.0408 1.0090 1.0005 1.0010 0.9848
dispcorr: -0.025944243 hartree
energy: -2014.690877194974
dipole: -15.03698 17.73635 2.69937 -3.04506 2.23367 -0.81139 -17.80080 17.36993 -0.43086
magnitude: 2.85142 au
magnitude: 7.24773 debye
