program: Orca
programVersion: 5.0.2
elementType: Cl F F O O O N N N C C C C C C C C C C C C C C C C C C C C C C C C C H H H H H H H H H H H H H H H H H H H H
charge: 0
multiplicity: 1
keywords: wb97x-d3
keywords: def2-TZVPP
keywords: def2/J RIJCOSX
keywords: DEFGRID2
keywords: scfconv7
keywords: smallprint printgap noloewdin
keywords: NOSOSCF
formula: C25H20ClF2N3O3
InChI: InChI=1/C25H20ClF2N3O3/c26-18-10-8-17(9-11-18)23(16-6-7-16)31-34-14-15-4-12-19(13-5-15)29-25(33)30-24(32)22-20(27)2-1-3-21(22)28/h1-5,8-13,16,29-30H,6-7,14H2
54 atoms
Cl -8.277361 -2.931898 2.280555
F  6.935784 1.827925 -1.603944
F  6.203517 -1.006188 2.039423
O  -4.062849 1.179667 -0.470287
O  2.714019 1.801372 2.464921
O  4.493926 0.429027 -1.003117
N  -3.782378 0.452783 -1.590817
N  2.258956 1.212593 0.304329
N  4.417235 1.109719 1.168628
C  -4.012926 -1.563856 -2.788454
C  -3.076187 -1.116382 -3.866074
C  -2.613396 -2.128094 -2.875808
C  -4.359521 -0.679819 -1.648601
C  -5.322812 -1.209987 -0.656737
C  -5.157592 -2.50026 -0.157905
C  -6.427462 -0.467166 -0.242482
C  -6.056095 -3.034444 0.752277
C  -7.34216 -0.995148 0.653027
C  -7.143268 -2.273839 1.150086
C  -3.275851 2.366209 -0.46241
C  -1.819058 2.089235 -0.237045
C  -0.956487 1.867425 -1.30711
C  -1.297866 1.999038 1.047834
C  0.895583 1.507489 0.19935
C  0.378616 1.580776 -1.095764
C  0.040111 1.713366 1.280342
C  3.05788 1.400469 1.371606
C  6.513586 0.420443 0.213837
C  5.048395 0.6467 0.056508
C  7.41203 0.995214 -0.677245
C  7.044075 -0.426558 1.177442
C  8.768833 0.76029 -0.618333
C  8.391053 -0.708462 1.262663
C  9.247542 -0.104118 0.355527
H  -4.810069 -2.235084 -3.085857
H  -2.671186 -0.115495 -3.80405
H  -3.29686 -1.450794 -4.87159
H  -2.504872 -3.157641 -3.192216
H  -1.908172 -1.808744 -2.118463
H  -4.312127 -3.100404 -0.470075
H  -6.600048 0.526534 -0.632725
H  -5.907154 -4.03303 1.140363
H  -8.200149 -0.411193 0.957805
H  -3.427744 2.920935 -1.392778
H  -3.686467 2.96231 0.353698
H  -1.325953 1.930248 -2.32286
H  -1.946604 2.158553 1.901307
H  1.032963 1.421002 -1.944782
H  0.39268 1.649451 2.296787
H  2.718132 0.92106 -0.553561
H  4.982952 1.310816 1.983396
H  9.436461 1.240083 -1.321184
H  8.759494 -1.388411 2.01886
H  10.307991 -0.309005 0.408773
elementType: Cl F O N C H
totalener: -2014.66502120 hartree
nucrepener: 3293.59917713 hartree
electener: -5308.26419833 hartree
oneelecener: -9307.26789826 hartree
twoeener: 3999.00369994 hartree
cpcmener: -0.03985021 hartree
kineticenergy: 2007.66825012 hartree
xcener: -167.133843348696 hartree
chargesum: -0.0000000
charge: -0.094049 -0.201101 -0.206479 -0.235622 -0.492601 -0.448025 -0.159588 -0.182460 -0.155444 -0.105678 -0.163950 -0.162849 0.243386 0.015880 -0.213029 -0.179678 -0.168528 -0.173902 0.119797 0.080312 -0.063728 -0.145021 -0.145575 0.201166 -0.223153 -0.217796 0.418038 -0.129838 0.401673 0.298490 0.308461 -0.239131 -0.240490 -0.064780 0.115768 0.084879 0.099800 0.096648 0.092120 0.157505 0.144472 0.142978 0.143433 0.097720 0.106203 0.145076 0.141682 0.139572 0.152947 0.199735 0.192514 0.152456 0.153006 0.166775
qa: -0.0940 -0.2011 -0.2065 -0.2356 -0.4926 -0.4480 -0.1596 -0.1825 -0.1554 -0.1057 -0.1640 -0.1628 0.2434 0.0159 -0.2130 -0.1797 -0.1685 -0.1739 0.1198 0.0803 -0.0637 -0.1450 -0.1456 0.2012 -0.2232 -0.2178 0.4180 -0.1298 0.4017 0.2985 0.3085 -0.2391 -0.2405 -0.0648 0.1158 0.0849 0.0998 0.0966 0.0921 0.1575 0.1445 0.1430 0.1434 0.0977 0.1062 0.1451 0.1417 0.1396 0.1529 0.1997 0.1925 0.1525 0.1530 0.1668
va: 1.2110 1.0982 1.0885 1.9465 2.0190 2.0652 2.9003 3.2444 3.2110 3.7819 3.9316 3.9108 3.7511 3.5798 4.0086 3.9918 4.0139 4.0078 3.8281 3.8751 3.6537 3.9278 3.9838 3.7758 3.9962 3.9819 4.3214 3.5461 4.0823 3.9590 3.9311 3.9557 3.9607 3.8128 1.0036 1.0318 1.0162 1.0187 1.0178 0.9931 1.0161 1.0080 1.0070 1.0081 0.9963 1.0069 1.0039 1.0097 1.0280 1.0410 1.0093 1.0008 1.0006 0.9849
dispcorr: -0.025199265 hartree
energy: -2014.690220461144
dipole: -13.46276 16.20687 2.74411 2.14389 -2.66836 -0.52447 -17.29509 16.49473 -0.80036
magnitude: 2.90616 au
magnitude: 7.38687 debye
