program: Orca
programVersion: 5.0.2
elementType: Cl F F O O O N N N C C C C C C C C C C C C C C C C C C C C C C C C C H H H H H H H H H H H H H H H H H H H H
charge: 0
multiplicity: 1
keywords: wb97x-d3
keywords: def2-TZVPP
keywords: def2/J RIJCOSX
keywords: DEFGRID2
keywords: scfconv7
keywords: smallprint printgap noloewdin
keywords: NOSOSCF
formula: C25H20ClF2N3O3
InChI: InChI=1/C25H20ClF2N3O3/c26-18-10-8-17(9-11-18)23(16-6-7-16)31-34-14-15-4-12-19(13-5-15)29-25(33)30-24(32)22-20(27)2-1-3-21(22)28/h1-5,8-13,16,29-30H,6-7,14H2
54 atoms
Cl -5.390685 -5.676768 -1.827435
F  5.880672 0.217146 -1.664132
F  6.27717 1.404306 2.836287
O  -4.532388 0.127184 0.893816
O  2.324669 3.34111 1.717731
O  3.931094 -0.266307 0.475067
N  -4.516764 0.901667 -0.237555
N  1.748799 1.192904 1.193332
N  3.955716 1.928852 1.084575
C  -4.601051 1.000853 -2.592632
C  -4.272496 2.459577 -2.624197
C  -3.249025 1.473715 -3.074941
C  -4.679196 0.248829 -1.317503
C  -4.876638 -1.215885 -1.417978
C  -5.863925 -1.884785 -0.696826
C  -4.061058 -1.949252 -2.277338
C  -6.031155 -3.253856 -0.826214
C  -4.206186 -3.321586 -2.402502
C  -5.193924 -3.963369 -1.673265
C  -3.900952 0.822751 1.951809
C  -2.417548 0.952674 1.746555
C  -1.6602 -0.125999 1.294433
C  -1.756857 2.141774 2.01415
C  0.364628 1.190242 1.400396
C  -0.295557 -0.009839 1.120157
C  -0.382941 2.274263 1.855232
C  2.607463 2.215404 1.360205
C  6.025613 0.822163 0.586978
C  4.539368 0.759257 0.709325
C  6.649231 0.505395 -0.612467
C  6.849991 1.122421 1.662443
C  8.019892 0.503688 -0.758444
C  8.225712 1.120077 1.569567
C  8.800837 0.811472 0.346175
H  -5.270114 0.632578 -3.362324
H  -4.113636 2.965699 -1.681434
H  -4.773779 3.055212 -3.376246
H  -3.035056 1.3871 -4.132558
H  -2.402329 1.292797 -2.424185
H  -6.529261 -1.340866 -0.040062
H  -3.290671 -1.451336 -2.852233
H  -6.807371 -3.759177 -0.267455
H  -3.555634 -3.877837 -3.06394
H  -4.356961 1.807564 2.097145
H  -4.117187 0.225346 2.840714
H  -2.134114 -1.074309 1.071651
H  -2.320844 3.001467 2.357293
H  0.269621 -0.863468 0.762884
H  0.078088 3.221375 2.080591
H  2.148559 0.318155 0.867958
H  4.554742 2.737266 1.197065
H  8.466275 0.265873 -1.714605
H  8.831767 1.350994 2.435242
H  9.878081 0.808951 0.251729
elementType: Cl F O N C H
totalener: -2014.66530046 hartree
nucrepener: 3333.10284394 hartree
electener: -5347.76814439 hartree
oneelecener: -9386.08117052 hartree
twoeener: 4038.31302613 hartree
cpcmener: -0.03968255 hartree
kineticenergy: 2007.64499890 hartree
xcener: -167.129565502115 hartree
chargesum: -0.0000000
charge: -0.093594 -0.201777 -0.206309 -0.239956 -0.493830 -0.447683 -0.174154 -0.171719 -0.155407 -0.086642 -0.158142 -0.169936 0.230745 0.013958 -0.181735 -0.211395 -0.163801 -0.167803 0.117656 0.118292 -0.020007 -0.204923 -0.162436 0.176543 -0.193775 -0.213091 0.418291 -0.127579 0.398029 0.303002 0.306668 -0.243046 -0.241072 -0.065241 0.112927 0.083080 0.098921 0.095807 0.094079 0.142119 0.160823 0.142525 0.141808 0.095227 0.107030 0.135968 0.140957 0.140805 0.157513 0.196946 0.193314 0.152549 0.152845 0.166624
qa: -0.0936 -0.2018 -0.2063 -0.2400 -0.4938 -0.4477 -0.1742 -0.1717 -0.1554 -0.0866 -0.1581 -0.1699 0.2307 0.0140 -0.1817 -0.2114 -0.1638 -0.1678 0.1177 0.1183 -0.0200 -0.2049 -0.1624 0.1765 -0.1938 -0.2131 0.4183 -0.1276 0.3980 0.3030 0.3067 -0.2430 -0.2411 -0.0652 0.1129 0.0831 0.0989 0.0958 0.0941 0.1421 0.1608 0.1425 0.1418 0.0952 0.1070 0.1360 0.1410 0.1408 0.1575 0.1969 0.1933 0.1525 0.1528 0.1666
va: 1.2115 1.0976 1.0884 1.9405 2.0182 2.0663 2.9111 3.2555 3.2086 3.7808 3.9246 3.9136 3.7478 3.5683 3.9921 3.9967 3.9983 4.0236 3.8266 3.8239 3.6402 3.9821 3.9874 3.8324 3.9538 3.9652 4.3164 3.5479 4.0817 3.9580 3.9354 3.9594 3.9603 3.8112 1.0040 1.0387 1.0156 1.0176 1.0161 1.0175 0.9904 1.0069 1.0085 1.0150 0.9936 1.0155 1.0033 1.0079 1.0307 1.0418 1.0083 1.0009 1.0006 0.9849
dispcorr: -0.025709233 hartree
energy: -2014.691009688106
dipole: -21.36650 23.84325 2.47676 16.08706 -15.85930 0.22776 -4.98696 4.29488 -0.69208
magnitude: 2.58170 au
magnitude: 6.56216 debye
