program: Orca
programVersion: 5.0.2
elementType: Cl F F O O O N N N C C C C C C C C C C C C C C C C C C C C C C C C C H H H H H H H H H H H H H H H H H H H H
charge: 0
multiplicity: 1
keywords: wb97x-d3
keywords: def2-TZVPP
keywords: def2/J RIJCOSX
keywords: DEFGRID2
keywords: scfconv7
keywords: smallprint printgap noloewdin
keywords: NOSOSCF
formula: C25H20ClF2N3O3
InChI: InChI=1/C25H20ClF2N3O3/c26-18-10-8-17(9-11-18)23(16-6-7-16)31-34-14-15-4-12-19(13-5-15)29-25(33)30-24(32)22-20(27)2-1-3-21(22)28/h1-5,8-13,16,29-30H,6-7,14H2
54 atoms
Cl -5.353834 -2.373957 -5.719111
F  6.465232 2.419221 1.553315
F  5.545216 -2.126092 0.989693
O  -4.368543 1.306513 -0.471913
O  2.240983 2.105143 3.228402
O  3.951935 0.130898 0.016643
N  -4.451941 0.32783 0.484461
N  1.776493 1.289857 1.143203
N  3.890237 1.082274 2.087067
C  -4.668177 -1.959985 1.001489
C  -3.364406 -2.357957 1.6567
C  -4.445131 -1.721236 2.461451
C  -4.659632 -0.84138 0.027724
C  -4.836974 -1.190743 -1.400284
C  -5.769353 -0.539947 -2.20633
C  -4.07842 -2.222254 -1.949657
C  -5.938446 -0.905298 -3.531761
C  -4.22531 -2.586017 -3.278782
C  -5.157243 -1.921676 -4.059376
C  -3.714696 2.434256 0.080746
C  -2.270554 2.15443 0.389265
C  -1.689098 2.581788 1.573312
C  -1.475997 1.448496 -0.511544
C  0.428692 1.619691 0.966216
C  -0.354571 2.331958 1.871027
C  -0.151521 1.183878 -0.229058
C  2.564849 1.539104 2.203856
C  5.951045 0.157942 1.269564
C  4.504676 0.452855 1.050271
C  6.892105 1.155214 1.482774
C  6.427428 -1.14352 1.178869
C  8.240777 0.894483 1.601931
C  7.764296 -1.45525 1.303499
C  8.665978 -0.421949 1.512119
H  -5.327894 -2.776906 0.732776
H  -2.492309 -1.761679 1.417993
H  -3.170501 -3.414919 1.78639
H  -5.00415 -2.342958 3.148566
H  -4.302608 -0.700795 2.790205
H  -6.392314 0.245454 -1.800375
H  -3.352381 -2.746826 -1.341572
H  -6.672951 -0.399208 -4.143734
H  -3.620287 -3.379987 -3.695351
H  -3.8087 3.210059 -0.682655
H  -4.238114 2.78544 0.975838
H  -2.286308 3.123136 2.297912
H  -1.891862 1.091441 -1.446026
H  0.04719 2.686926 2.805851
H  0.44569 0.62912 -0.943823
H  2.209721 0.788092 0.373557
H  4.437311 1.257126 2.920614
H  8.940871 1.704189 1.757023
H  8.092088 -2.483914 1.238675
H  9.719253 -0.647606 1.606532
elementType: Cl F O N C H
totalener: -2014.66520163 hartree
nucrepener: 3337.53336214 hartree
electener: -5352.19856377 hartree
oneelecener: -9394.94549146 hartree
twoeener: 4042.74692769 hartree
cpcmener: -0.03963153 hartree
kineticenergy: 2007.65189446 hartree
xcener: -167.131143999765 hartree
chargesum: -0.0000000
charge: -0.093691 -0.206386 -0.201542 -0.240958 -0.493539 -0.447168 -0.173915 -0.173144 -0.154870 -0.088961 -0.166722 -0.156678 0.226787 0.020701 -0.180861 -0.213328 -0.169325 -0.168875 0.119515 0.116223 -0.016473 -0.162572 -0.202647 0.181779 -0.210858 -0.196997 0.416662 -0.129878 0.398852 0.309065 0.299948 -0.242808 -0.240546 -0.064668 0.113211 0.092762 0.096092 0.099235 0.083249 0.143877 0.159521 0.143820 0.142443 0.107064 0.094838 0.140169 0.134017 0.154621 0.139575 0.198484 0.192978 0.153164 0.152129 0.166630
qa: -0.0937 -0.2064 -0.2015 -0.2410 -0.4935 -0.4472 -0.1739 -0.1731 -0.1549 -0.0890 -0.1667 -0.1567 0.2268 0.0207 -0.1809 -0.2133 -0.1693 -0.1689 0.1195 0.1162 -0.0165 -0.1626 -0.2026 0.1818 -0.2109 -0.1970 0.4167 -0.1299 0.3989 0.3091 0.2999 -0.2428 -0.2405 -0.0647 0.1132 0.0928 0.0961 0.0992 0.0832 0.1439 0.1595 0.1438 0.1424 0.1071 0.0948 0.1402 0.1340 0.1546 0.1396 0.1985 0.1930 0.1532 0.1521 0.1666
va: 1.2116 1.0884 1.0977 1.9391 2.0198 2.0677 2.9008 3.2531 3.2110 3.7788 3.9142 3.9220 3.7415 3.5573 3.9904 4.0009 4.0033 4.0214 3.8275 3.8278 3.6337 3.9864 3.9789 3.8207 3.9670 3.9513 4.3195 3.5506 4.0802 3.9323 3.9585 3.9611 3.9582 3.8118 1.0038 1.0164 1.0180 1.0155 1.0393 1.0168 0.9917 1.0067 1.0084 0.9940 1.0142 1.0036 1.0166 1.0314 1.0088 1.0420 1.0085 1.0007 1.0010 0.9849
dispcorr: -0.025833064 hartree
energy: -2014.691034694326
dipole: -21.46702 23.86137 2.39435 0.13980 -1.07153 -0.93173 14.39824 -13.85089 0.54735
magnitude: 2.62691 au
magnitude: 6.67707 debye
