program: Orca
programVersion: 5.0.2
elementType: Cl F F O O O N N N C C C C C C C C C C C C C C C C C C C C C C C C C H H H H H H H H H H H H H H H H H H H H
charge: 0
multiplicity: 1
keywords: wb97x-d3
keywords: def2-TZVPP
keywords: def2/J RIJCOSX
keywords: DEFGRID2
keywords: scfconv7
keywords: smallprint printgap noloewdin
keywords: NOSOSCF
formula: C25H20ClF2N3O3
InChI: InChI=1/C25H20ClF2N3O3/c26-18-10-8-17(9-11-18)23(16-6-7-16)31-34-14-15-4-12-19(13-5-15)29-25(33)30-24(32)22-20(27)2-1-3-21(22)28/h1-5,8-13,16,29-30H,6-7,14H2
54 atoms
Cl -6.247365 -2.837101 -5.337079
F  5.980945 -0.151174 3.490065
F  6.750841 0.956311 -0.976334
O  -4.134892 1.087988 -0.59013
O  2.71156 3.082992 2.343939
O  4.235573 -0.173113 0.28061
N  -4.35308 0.252595 0.4671
N  2.101376 1.396219 0.917378
N  4.297512 1.64217 1.656708
C  -5.006324 -1.873468 1.234719
C  -3.782146 -2.510046 1.853253
C  -4.615073 -1.557738 2.641446
C  -4.827924 -0.88248 0.143988
C  -5.173285 -1.328694 -1.22493
C  -5.928807 -0.545983 -2.096108
C  -4.767959 -2.59183 -1.649757
C  -6.267455 -1.010303 -3.354862
C  -5.083787 -3.059952 -2.914334
C  -5.835791 -2.262934 -3.761106
C  -3.443644 2.23583 -0.154185
C  -1.998294 1.98075 0.174068
C  -1.362104 2.716211 1.162476
C  -1.24405 1.051501 -0.533685
C  0.736705 1.641721 0.72015
C  -0.012114 2.567192 1.441764
C  0.100048 0.88203 -0.262564
C  2.960223 2.109593 1.675134
C  6.31413 0.407046 1.24739
C  4.844822 0.578062 1.008063
C  6.828004 0.012038 2.472958
C  7.216511 0.560696 0.204533
C  8.173278 -0.222982 2.673751
C  8.570447 0.345648 0.360904
C  9.037711 -0.051223 1.60444
H  -5.861388 -2.526624 1.099692
H  -2.818382 -2.161006 1.504839
H  -3.822887 -3.565021 2.092122
H  -5.243431 -1.956068 3.426833
H  -4.213338 -0.574138 2.839156
H  -6.274587 0.430677 -1.790178
H  -4.186421 -3.219469 -0.986797
H  -6.863006 -0.39952 -4.019058
H  -4.750392 -4.036688 -3.236222
H  -3.520905 2.934831 -0.991074
H  -3.952331 2.689245 0.703078
H  -1.929726 3.434549 1.742819
H  -1.705949 0.451046 -1.307021
H  0.440507 3.16434 2.215625
H  0.667013 0.153084 -0.830535
H  2.500812 0.618368 0.404202
H  4.90466 2.215642 2.22276
H  8.529296 -0.537253 3.644738
H  9.240306 0.485547 -0.475673
H  10.095123 -0.22869 1.742679
totalener: -2014.63127337 hartree
nucrepener: 3288.47987116 hartree
electener: -5303.11114454 hartree
oneelecener: -9295.92257766 hartree
twoeener: 3992.81143313 hartree
kineticenergy: 2007.71403510 hartree
xcener: -167.135972250510 hartree
chargesum: -0.0000000
charge: -0.077246 -0.187241 -0.180180 -0.220002 -0.404506 -0.375208 -0.145282 -0.192457 -0.174837 -0.097912 -0.157155 -0.123879 0.207652 0.023996 -0.133981 -0.197045 -0.149273 -0.147918 0.108642 0.091071 0.021934 -0.131911 -0.192918 0.168153 -0.172663 -0.165669 0.388285 -0.157697 0.374166 0.284731 0.299052 -0.228823 -0.228415 -0.043392 0.098382 0.087945 0.079293 0.079289 0.083152 0.118124 0.136715 0.118487 0.118840 0.092301 0.083812 0.105532 0.119824 0.146636 0.108305 0.175600 0.167072 0.130960 0.130633 0.137024
qa: -0.0772 -0.1872 -0.1802 -0.2200 -0.4045 -0.3752 -0.1453 -0.1925 -0.1748 -0.0979 -0.1572 -0.1239 0.2077 0.0240 -0.1340 -0.1970 -0.1493 -0.1479 0.1086 0.0911 0.0219 -0.1319 -0.1929 0.1682 -0.1727 -0.1657 0.3883 -0.1577 0.3742 0.2847 0.2991 -0.2288 -0.2284 -0.0434 0.0984 0.0879 0.0793 0.0793 0.0832 0.1181 0.1367 0.1185 0.1188 0.0923 0.0838 0.1055 0.1198 0.1466 0.1083 0.1756 0.1671 0.1310 0.1306 0.1370
va: 1.2296 1.1112 1.1287 1.9757 2.1068 2.1377 2.9190 3.2570 3.1914 3.8273 3.9234 3.9329 3.7482 3.6533 4.0119 4.0166 4.0193 4.0431 3.9145 3.8805 3.6955 4.0124 4.0592 3.8990 4.0251 3.9887 4.3202 3.5809 4.0978 3.9903 4.0033 3.9967 3.9981 3.8453 1.0052 1.0203 1.0184 1.0181 1.0429 1.0268 0.9979 1.0142 1.0158 0.9895 1.0152 1.0115 1.0216 1.0322 1.0160 1.0664 1.0271 1.0088 1.0089 0.9957
dispcorr: -0.025042385 hartree
energy: -2014.656315760151
dipole: -21.61795 23.36466 1.74672 0.27395 -0.70997 -0.43603 14.27035 -13.68530 0.58505
magnitude: 1.89299 au
magnitude: 4.81160 debye
