program: Orca
programVersion: 5.0.2
elementType: Cl F F O O O N N N C C C C C C C C C C C C C C C C C C C C C C C C C H H H H H H H H H H H H H H H H H H H H
charge: 0
multiplicity: 1
keywords: wb97x-d3
keywords: def2-TZVPP
keywords: def2/J RIJCOSX
keywords: DEFGRID2
keywords: scfconv7
keywords: smallprint printgap noloewdin
keywords: NOSOSCF
formula: C25H20ClF2N3O3
InChI: InChI=1/C25H20ClF2N3O3/c26-18-10-8-17(9-11-18)23(16-6-7-16)31-34-14-15-4-12-19(13-5-15)29-25(33)30-24(32)22-20(27)2-1-3-21(22)28/h1-5,8-13,16,29-30H,6-7,14H2
54 atoms
Cl -5.992379 -2.690733 -5.560536
F  5.654675 -1.81359 1.965528
F  6.747896 2.530613 0.67284
O  -4.22139 1.132123 -0.568013
O  2.507708 2.824017 2.740534
O  4.140876 0.055124 0.121418
N  -4.344033 0.203116 0.424488
N  1.985293 1.494643 0.9480
N  4.12784 1.53497 1.856071
C  -4.779089 -2.019204 1.053177
C  -3.494274 -2.599434 1.60075
C  -4.372327 -1.762016 2.467236
C  -4.708488 -0.94873 0.026052
C  -5.022453 -1.338493 -1.367192
C  -4.531689 -2.546102 -1.860007
C  -5.829202 -0.562734 -2.198344
C  -4.815089 -2.965121 -3.149113
C  -6.135165 -0.979904 -3.481836
C  -5.619528 -2.176212 -3.954539
C  -3.577667 2.27895 -0.060094
C  -2.12066 2.057651 0.238147
C  -1.506106 2.716038 1.291975
C  -1.339442 1.223351 -0.554273
C  0.619164 1.736816 0.765276
C  -0.153022 2.576275 1.56319
C  0.006846 1.063373 -0.293244
C  2.796126 2.01669 1.890979
C  6.153771 0.37131 1.322355
C  4.709618 0.629031 1.02221
C  6.575149 -0.87765 1.755196
C  7.131746 1.330732 1.11228
C  7.902787 -1.165792 1.996755
C  8.472233 1.085568 1.331118
C  8.845531 -0.172522 1.777608
H  -5.586564 -2.726153 0.896797
H  -2.567435 -2.160451 1.253811
H  -3.451771 -3.667187 1.773495
H  -4.945751 -2.253133 3.24191
H  -4.037896 -0.764959 2.715572
H  -3.908668 -3.168586 -1.23086
H  -6.242169 0.369391 -1.841756
H  -4.4159 -3.898082 -3.52201
H  -6.770921 -0.375411 -4.113673
H  -3.695889 3.029114 -0.846246
H  -4.095393 2.648165 0.831526
H  -2.094314 3.361192 1.93441
H  -1.783228 0.68516 -1.382268
H  0.282389 3.109272 2.391899
H  0.59421 0.404446 -0.922716
H  2.412101 0.822695 0.319765
H  4.693751 1.937303 2.588066
H  8.187873 -2.147983 2.347193
H  9.202613 1.861621 1.149764
H  9.890375 -0.383815 1.957529
totalener: -2014.63153725 hartree
nucrepener: 3304.72167248 hartree
electener: -5319.35320974 hartree
oneelecener: -9328.39331610 hartree
twoeener: 4009.04010637 hartree
kineticenergy: 2007.71789922 hartree
xcener: -167.137289408205 hartree
chargesum: -0.0000000
charge: -0.077079 -0.180014 -0.187029 -0.220763 -0.405392 -0.374115 -0.142549 -0.190061 -0.175774 -0.090311 -0.160861 -0.123607 0.199173 0.022864 -0.196657 -0.134646 -0.147214 -0.148712 0.109073 0.091520 0.020628 -0.128205 -0.190322 0.167562 -0.176465 -0.169366 0.388974 -0.153637 0.372790 0.296987 0.282805 -0.227864 -0.228650 -0.042725 0.098024 0.088717 0.079451 0.078925 0.082601 0.137231 0.119085 0.118371 0.118318 0.091655 0.084362 0.105088 0.119108 0.149225 0.107472 0.175766 0.167624 0.130151 0.131491 0.136976
qa: -0.0771 -0.1800 -0.1870 -0.2208 -0.4054 -0.3741 -0.1425 -0.1901 -0.1758 -0.0903 -0.1609 -0.1236 0.1992 0.0229 -0.1967 -0.1346 -0.1472 -0.1487 0.1091 0.0915 0.0206 -0.1282 -0.1903 0.1676 -0.1765 -0.1694 0.3890 -0.1536 0.3728 0.2970 0.2828 -0.2279 -0.2287 -0.0427 0.0980 0.0887 0.0795 0.0789 0.0826 0.1372 0.1191 0.1184 0.1183 0.0917 0.0844 0.1051 0.1191 0.1492 0.1075 0.1758 0.1676 0.1302 0.1315 0.1370
va: 1.2299 1.1290 1.1115 1.9736 2.1073 2.1387 2.9212 3.2596 3.1919 3.8246 3.9227 3.9342 3.7528 3.6545 4.0152 4.0103 4.0442 4.0185 3.9139 3.8814 3.6912 4.0067 4.0551 3.9119 4.0200 3.9826 4.3196 3.5806 4.0952 4.0062 3.9896 3.9970 3.9983 3.8453 1.0050 1.0192 1.0181 1.0181 1.0431 0.9976 1.0279 1.0159 1.0144 0.9900 1.0145 1.0116 1.0213 1.0323 1.0164 1.0668 1.0270 1.0091 1.0086 0.9958
dispcorr: -0.025255536 hartree
energy: -2014.656792787153
dipole: -20.94954 22.72649 1.77695 -0.47531 -0.06098 -0.53629 14.14806 -13.50303 0.64503
magnitude: 1.96500 au
magnitude: 4.99463 debye
