program: Orca
programVersion: 5.0.2
elementType: Cl F F O O O N N N C C C C C C C C C C C C C C C C C C C C C C C C C H H H H H H H H H H H H H H H H H H H H
charge: 0
multiplicity: 1
keywords: wb97x-d3
keywords: def2-TZVPP
keywords: def2/J RIJCOSX
keywords: DEFGRID2
keywords: scfconv7
keywords: smallprint printgap noloewdin
keywords: NOSOSCF
formula: C25H20ClF2N3O3
InChI: InChI=1/C25H20ClF2N3O3/c26-18-10-8-17(9-11-18)23(16-6-7-16)31-34-14-15-4-12-19(13-5-15)29-25(33)30-24(32)22-20(27)2-1-3-21(22)28/h1-5,8-13,16,29-30H,6-7,14H2
54 atoms
Cl -6.846472 -1.600181 4.191507
F  6.818131 2.466318 0.424385
F  6.185673 -2.060801 -0.505943
O  -4.081363 1.150074 -1.045103
O  2.513211 1.676677 1.869968
O  4.541214 0.229455 -1.442261
N  -3.909587 0.01486 -1.779251
N  2.222151 1.103408 -0.330517
N  4.285139 0.894305 0.723418
C  -4.368034 -2.275451 -2.053172
C  -5.331248 -2.420316 -3.20882
C  -3.86838 -2.272549 -3.460497
C  -4.389677 -1.032724 -1.241014
C  -4.995852 -1.126603 0.1065
C  -6.17298 -1.850703 0.276723
C  -4.3938 -0.561259 1.230099
C  -6.75382 -1.994674 1.526008
C  -4.95512 -0.712969 2.485456
C  -6.138199 -1.422124 2.625783
C  -3.242875 2.171055 -1.555806
C  -1.798781 1.932444 -1.228724
C  -0.946071 1.321481 -2.139735
C  -1.288414 2.258243 0.021377
C  0.873974 1.396344 -0.556722
C  0.370533 1.06012 -1.813711
C  0.027384 2.001199 0.37097
C  2.922089 1.265198 0.811704
C  6.450452 0.209699 -0.048868
C  5.002491 0.445579 -0.34396
C  7.317314 1.2356 0.296023
C  6.997884 -1.05783 -0.191503
C  8.667004 1.031345 0.49938
C  8.339091 -1.310852 0.011478
C  9.167246 -0.253091 0.354428
H  -4.189987 -3.1745 -1.473503
H  -5.968137 -1.573193 -3.429264
H  -5.79527 -3.385366 -3.36677
H  -3.315044 -3.142433 -3.788244
H  -3.512045 -1.334772 -3.861587
H  -6.65301 -2.304402 -0.580811
H  -3.466847 -0.014032 1.134086
H  -7.675093 -2.548242 1.642086
H  -4.474919 -0.281045 3.352481
H  -3.386307 2.268103 -2.636478
H  -3.60198 3.086909 -1.083349
H  -1.31768 1.038028 -3.116259
H  -1.931882 2.73388 0.752714
H  1.015906 0.584101 -2.542958
H  0.384003 2.274122 1.350171
H  2.739753 0.725208 -1.116603
H  4.765441 1.014845 1.602458
H  9.307681 1.861931 0.759816
H  8.721941 -2.315689 -0.098122
H  10.221439 -0.43355 0.512198
totalener: -2014.63105064 hartree
nucrepener: 3310.10506862 hartree
electener: -5324.73611926 hartree
oneelecener: -9339.17828186 hartree
twoeener: 4014.44216260 hartree
kineticenergy: 2007.73546110 hartree
xcener: -167.138899205361 hartree
chargesum: -0.0000000
charge: -0.079118 -0.187673 -0.178568 -0.209229 -0.404182 -0.374525 -0.145968 -0.190135 -0.176059 -0.099982 -0.162221 -0.126557 0.215885 0.039092 -0.201790 -0.138486 -0.145117 -0.152832 0.110883 0.067307 -0.056156 -0.082549 -0.163310 0.180836 -0.197070 -0.163077 0.389655 -0.154999 0.375649 0.278013 0.297489 -0.225982 -0.225940 -0.043513 0.099808 0.085872 0.079646 0.080052 0.076294 0.136249 0.128063 0.117811 0.117494 0.086009 0.093856 0.109453 0.117272 0.108176 0.149866 0.176422 0.167457 0.132116 0.130901 0.137413
qa: -0.0791 -0.1877 -0.1786 -0.2092 -0.4042 -0.3745 -0.1460 -0.1901 -0.1761 -0.1000 -0.1622 -0.1266 0.2159 0.0391 -0.2018 -0.1385 -0.1451 -0.1528 0.1109 0.0673 -0.0562 -0.0825 -0.1633 0.1808 -0.1971 -0.1631 0.3897 -0.1550 0.3756 0.2780 0.2975 -0.2260 -0.2259 -0.0435 0.0998 0.0859 0.0796 0.0801 0.0763 0.1362 0.1281 0.1178 0.1175 0.0860 0.0939 0.1095 0.1173 0.1082 0.1499 0.1764 0.1675 0.1321 0.1309 0.1374
va: 1.2275 1.1107 1.1311 1.9648 2.1078 2.1382 2.8996 3.2595 3.1940 3.8416 3.9295 3.9367 3.7523 3.6650 4.0212 4.0307 4.0408 4.0350 3.9073 3.9107 3.6930 3.9855 3.9816 3.8997 4.0293 4.0054 4.3196 3.5786 4.0934 3.9871 4.0029 3.9943 3.9957 3.8473 1.0055 1.0196 1.0191 1.0180 1.0430 0.9975 1.0099 1.0163 1.0154 1.0124 0.9970 1.0162 1.0104 1.0162 1.0316 1.0668 1.0276 1.0085 1.0089 0.9958
dispcorr: -0.025464179 hartree
energy: -2014.656514815386
dipole: -21.09965 23.18799 2.08834 -2.77222 2.22532 -0.54690 -21.04592 20.59668 -0.44924
magnitude: 2.20501 au
magnitude: 5.60469 debye
