program: Gaussian 09
title: 000055099
version: EM64L-G09RevD.01
frameworkgroup: C1[X(C4H3Cl7)]
method: RPBEPBE
basis: SDD
operation: Freq
keyword: #pfreq=noraman
keyword: PBEPBE/SDD
title: #p freq=noraman PBEPBE/SDD
converged: YES YES NO NO
title: Mulliken charges:
elementType: Cl Cl Cl Cl Cl Cl Cl C C C C H H H
charge: 0.127524 0.126797 0.073050 0.072792 0.163823 0.159803 0.163636 -0.194590 -0.325889 -0.599053 -0.539876 0.251644 0.268481 0.251857
chargesum: 0.00000
title: Mulliken charges with hydrogens summed into heavy atoms:
elementType: Cl Cl Cl Cl Cl Cl Cl C C C C
charge: 0.127524 0.126797 0.073050 0.072792 0.163823 0.159803 0.163636 -0.194590 -0.325889 -0.599053 0.232105
polarizability: 9.63831287e+01 1.96099473e-01 1.25036228e+02 -8.64433728e+00 9.03491929e-01 1.04750798e+02
1716.lowfreq: -12.3197 -4.9818 -1.7241 -0.0029 -0.0018 -0.0013 18.8420 93.8264 141.9177
frequency: 18.2541 93.8225 141.9154 153.7341 178.3489 179.0599 204.8635 211.0888 212.7734 251.3414 261.7734 274.6060 280.1297 307.8155 311.2208 349.7238 351.2193 371.9148 430.7836 603.0580 647.4764 668.1906 702.1483 704.2236 778.3207 866.7585 970.6819 1076.6052 1080.6220 1118.0550 1396.1480 1452.4645 1458.8573 3023.6695 3133.0334 3134.9022
redmass: 18.6691 13.5978 20.9094 24.3832 27.3210 17.4539 5.7103 27.2025 32.2345 2.5581 14.7206 16.1811 2.6665 5.3407 15.2645 14.4511 3.1737 17.6917 6.2838 6.2688 5.6773 12.5394 11.4833 9.0312 10.0066 4.9242 9.0819 3.7531 1.5217 2.3328 1.1750 1.0433 1.0425 1.0346 1.1009 1.1009
irintensity: 0.2151 0.4061 0.0689 0.0718 0.3810 0.1438 0.0233 0.0003 0.0540 0.0115 0.5328 0.7811 0.0468 5.3173 0.0743 2.7299 1.2641 0.8270 15.1318 68.7364 108.7674 90.5167 107.4432 46.6432 15.5558 3.2608 2.9269 26.4364 36.3683 33.5093 29.3600 13.4360 9.5013 2.3512 2.4151 2.8147
temp: 298.150 k
press: 1.00000 atm
elementType: 17 17 17 17 17 17 17 6 6 6 6 1 1 1
symmnumber: 1
zpe: 163886.0 jmol-1
zpe.correction: 0.062421 hartree
zpe.thermalcorrener: 0.075962 hartree
zpe.thermalcorrenthalpy: 0.076906 hartree
zpe.thermalcorrgfe: 0.020778 hartree
zpe.sumelectzpe: -3373.737141 hartree
zpe.sumelectthermal: -3373.723600 hartree
zpe.sumelectthermalent: -3373.722656 hartree
zpe.sumelectthermalfe: -3373.778783 hartree
dipole: 1.4538 -0.0497 1.4372
dipole: 2.0449
quadrupole: -110.5816 -111.9080 -111.4137
quadrupole: -0.1351 3.8350 0.0135
quadrupole: 0.7194 -0.6069 -0.1126 -0.1351 3.8350 0.0135
hfenergy: -3373.7995616 hartree
pointgroup: C01 [X(C4H3Cl7)]
dipole: -0.6443734 0.4816795 0.0020971 debye
dipolederiv: -0.1884187 0.008556 -0.0028601 0.0123067 -0.2861599 0.2837725 -0.0067324 0.2223035 -0.4425525 -0.1883616 0.0092807 0.0020429 0.0131634 -0.2973682 -0.287466 0.0077945 -0.2256396 -0.4318574 -0.1937323 -0.0633207 -0.0763926 -0.0394626 -0.2884234 -0.2374271 -0.0279459 -0.2066379 -0.4579507 -0.1922712 -0.0609973 0.0745275 -0.037678 -0.2878751 0.2381523 0.0255263 0.2071486 -0.4599785 -0.1323221 0.0748902 0.0695178 0.0178849 -0.3118761 -0.2724565 -0.0221419 -0.2763448 -0.4562265 -0.5089912 -0.3158345 0.0057141 -0.2740124 -0.3758816 0.0049463 0.0056063 0.0051442 -0.0962158 -0.1335213 0.0747331 -0.0747296 0.0208921 -0.2938982 0.2666589 0.0182978 0.2700331 -0.4729461 0.3135821 0.0072159 0.0014866 -0.1053252 0.4447047 0.005119 -0.0000794 0.0053118 0.769962 0.4551085 0.1105464 0.0009246 0.2577684 0.6460608 -0.0014635 0.0003987 -0.0026568 0.981252 0.7808177 0.164488 -0.0002511 0.1988995 1.0334341 -0.0001402 -0.0010907 0.001081 1.0425622 -0.2604622 0.0308568 0.0007483 -0.032572 -0.1163044 0.0007537 0.0007876 -0.0001429 -0.1019886 0.1377742 0.0084951 0.0338387 0.0163663 0.0380798 0.0707049 0.0037775 0.0771488 0.0008871 -0.0265994 -0.0571613 0.0001629 -0.0651144 0.0567047 -0.0000706 -0.0000384 -0.0000298 0.1242736 0.1373976 0.0082516 -0.0347299 0.0168833 0.0388029 -0.0710836 -0.00416 -0.076719 0.000779 unknown
polarizability: 94.1837585|7.1824805|106.909646|0.0700412|0.105039|125.0767502 unknown
InChI: InChI=1S/C4H3Cl7/c1-2(5,6)3(7,8)4(9,10)11/h1H3
charge 0 multiplicity 1
14 atoms
Cl 0.038379 1.623473 -1.535202
Cl 0.040523 1.657966 1.496954
Cl -1.700855 -1.245791 -1.511274
Cl -1.688852 -1.243086 1.515636
Cl 1.538627 -1.379459 -1.482023
Cl 2.791085 0.909702 -0.021393
Cl 1.551465 -1.331865 1.519078
C  -0.010642 0.526804 -0.006435
C  -1.44751 -0.148265 0.000531
C  1.350443 -0.288876 0.002011
C  -2.60442 0.858891 0.003531
H  -2.569577 1.494863 -0.894625
H  -3.54767 0.291129 0.003196
H  -2.568293 1.491314 0.904015
