program: Orca
programVersion: 5.0.2
elementType: Cl F F O O O N N N C C C C C C C C C C C C C C C C C C C C C C C C C H H H H H H H H H H H H H H H H H H H H
charge: 0
multiplicity: 1
keywords: wb97x-d3
keywords: def2-TZVPP
keywords: def2/J RIJCOSX
keywords: DEFGRID2
keywords: scfconv7
keywords: smallprint printgap noloewdin
keywords: NOSOSCF
formula: C25H20ClF2N3O3
InChI: InChI=1/C25H20ClF2N3O3/c26-18-10-8-17(9-11-18)23(16-6-7-16)31-34-14-15-4-12-19(13-5-15)29-25(33)30-24(32)22-20(27)2-1-3-21(22)28/h1-5,8-13,16,29-30H,6-7,14H2
54 atoms
Cl -6.970621 -0.904982 -5.564735
F  5.966437 -1.994057 1.415616
F  6.772716 2.533336 2.222478
O  -4.22679 1.201686 -0.018155
O  2.700877 0.113054 -1.073699
O  4.24999 1.049212 2.656032
N  -4.180543 -0.002637 0.625093
N  2.112273 0.9521 0.976223
N  4.299245 0.313413 0.498989
C  -4.482675 -2.330397 0.551941
C  -3.113071 -2.972587 0.584863
C  -3.766506 -2.525831 1.848144
C  -4.619835 -0.982767 -0.056034
C  -5.19863 -0.920224 -1.416889
C  -4.820299 -1.874351 -2.359309
C  -6.146789 0.033856 -1.783122
C  -5.351673 -1.871171 -3.637761
C  -6.699591 0.035608 -3.051925
C  -6.29246 -0.913092 -3.976459
C  -3.464705 2.139763 0.708571
C  -2.00054 1.800009 0.753717
C  -1.254351 2.037177 1.899212
C  -1.349466 1.256395 -0.346809
C  0.744469 1.21057 0.831646
C  0.098275 1.754895 1.939946
C  0.003399 0.958758 -0.322426
C  2.959791 0.447076 0.05677
C  6.315919 0.283448 1.800441
C  4.852235 0.585573 1.71384
C  6.821238 -1.001866 1.670638
C  7.225241 1.290451 2.096324
C  8.163721 -1.291693 1.806884
C  8.576901 1.048307 2.233074
C  9.035665 -0.251812 2.087099
H  -5.311666 -2.997499 0.342339
H  -2.283444 -2.382892 0.215472
H  -3.043021 -4.032548 0.376423
H  -4.157134 -3.281672 2.516253
H  -3.373848 -1.646968 2.339198
H  -4.09006 -2.628144 -2.095758
H  -6.47538 0.775944 -1.070269
H  -5.03877 -2.609043 -4.363274
H  -7.442616 0.773214 -3.321542
H  -3.626467 3.08544 0.185358
H  -3.856814 2.252078 1.725587
H  -1.733209 2.443007 2.782505
H  -1.906227 1.048361 -1.25218
H  0.655878 1.948836 2.849032
H  0.470126 0.536281 -1.196752
H  2.520626 1.180952 1.875782
H  4.899061 -0.048626 -0.226945
H  8.511446 -2.309631 1.701325
H  9.251827 1.864016 2.450547
H  10.091353 -0.45811 2.195049
totalener: -2014.63085604 hartree
nucrepener: 3311.48161105 hartree
electener: -5326.11246709 hartree
oneelecener: -9342.03983809 hartree
twoeener: 4015.92737100 hartree
kineticenergy: 2007.71739211 hartree
xcener: -167.137234139040 hartree
chargesum: 0.0000000
charge: -0.077370 -0.187690 -0.178163 -0.218876 -0.405471 -0.375262 -0.142724 -0.189358 -0.176463 -0.080924 -0.165456 -0.122606 0.191955 0.024851 -0.199332 -0.132601 -0.146740 -0.152380 0.110461 0.090741 0.017882 -0.135096 -0.181077 0.173016 -0.183524 -0.167288 0.388999 -0.152853 0.375740 0.276315 0.295195 -0.225960 -0.224930 -0.043622 0.097412 0.091681 0.079848 0.078800 0.081112 0.139396 0.118715 0.118499 0.118771 0.091705 0.080601 0.105479 0.118811 0.107401 0.149810 0.175433 0.167043 0.132013 0.130558 0.137523
qa: -0.0774 -0.1877 -0.1782 -0.2189 -0.4055 -0.3753 -0.1427 -0.1894 -0.1765 -0.0809 -0.1655 -0.1226 0.1920 0.0249 -0.1993 -0.1326 -0.1467 -0.1524 0.1105 0.0907 0.0179 -0.1351 -0.1811 0.1730 -0.1835 -0.1673 0.3890 -0.1529 0.3757 0.2763 0.2952 -0.2260 -0.2249 -0.0436 0.0974 0.0917 0.0798 0.0788 0.0811 0.1394 0.1187 0.1185 0.1188 0.0917 0.0806 0.1055 0.1188 0.1074 0.1498 0.1754 0.1670 0.1320 0.1306 0.1375
va: 1.2300 1.1105 1.1318 1.9703 2.1072 2.1373 2.9181 3.2604 3.1938 3.8160 3.9221 3.9369 3.7619 3.6559 4.0202 4.0090 4.0470 4.0217 3.9145 3.8900 3.6972 4.0427 4.0031 3.9078 4.0138 3.9791 4.3204 3.5800 4.0930 3.9869 4.0048 3.9940 3.9942 3.8476 1.0049 1.0181 1.0183 1.0182 1.0426 0.9969 1.0278 1.0161 1.0143 0.9912 1.0117 1.0110 1.0216 1.0168 1.0323 1.0667 1.0280 1.0085 1.0091 0.9957
dispcorr: -0.025574428 hartree
energy: -2014.656430470161
dipole: -17.62051 19.57761 1.95709 -5.40856 4.99022 -0.41834 11.59958 -10.76227 0.83731
magnitude: 2.16940 au
magnitude: 5.51419 debye
