program: Orca
programVersion: 5.0.2
elementType: Cl F F O O O N N N C C C C C C C C C C C C C C C C C C C C C C C C C H H H H H H H H H H H H H H H H H H H H
charge: 0
multiplicity: 1
keywords: wb97x-d3
keywords: def2-TZVPP
keywords: def2/J RIJCOSX
keywords: DEFGRID2
keywords: scfconv7
keywords: smallprint printgap noloewdin
keywords: NOSOSCF
formula: C25H20ClF2N3O3
InChI: InChI=1/C25H20ClF2N3O3/c26-18-10-8-17(9-11-18)23(16-6-7-16)31-34-14-15-4-12-19(13-5-15)29-25(33)30-24(32)22-20(27)2-1-3-21(22)28/h1-5,8-13,16,29-30H,6-7,14H2
54 atoms
Cl -6.769354 1.280813 -5.413329
F  5.752809 2.075364 1.022667
F  6.876476 -2.278981 2.291758
O  -4.198917 -1.422116 -0.074862
O  2.693859 -0.263851 -1.295332
O  4.244356 -1.046783 2.462765
N  -4.154704 -0.302745 0.705477
N  2.13739 -1.113827 0.759261
N  4.289823 -0.364362 0.289513
C  -4.450623 2.018822 0.90063
C  -3.766366 2.054405 2.227639
C  -3.081277 2.644439 1.042403
C  -4.577574 0.752894 0.136268
C  -5.124712 0.848617 -1.235295
C  -6.069984 -0.050523 -1.72606
C  -4.710812 1.891316 -2.061367
C  -6.584438 0.086014 -3.003451
C  -5.203585 2.027448 -3.348362
C  -6.141217 1.12017 -3.81243
C  -3.410095 -2.428742 0.520744
C  -1.950527 -2.072304 0.55884
C  -1.330606 -1.469898 -0.529441
C  -1.181461 -2.335294 1.682663
C  0.778202 -1.414548 0.619833
C  0.014216 -1.139688 -0.514367
C  0.164055 -2.019078 1.714692
C  2.963239 -0.57459 -0.16068
C  6.256144 -0.119085 1.655686
C  4.831665 -0.555332 1.524308
C  6.659578 1.19238 1.4466
C  7.222526 -1.010566 2.105811
C  7.952468 1.618816 1.672943
C  8.529187 -0.630329 2.333475
C  8.881717 0.693143 2.119231
H  -5.27275 2.710298 0.752887
H  -3.388642 1.121267 2.620234
H  -4.170702 2.727712 2.971693
H  -3.003402 3.72128 0.964178
H  -2.24471 2.098612 0.624482
H  -6.42617 -0.859673 -1.105381
H  -3.981756 2.605203 -1.700793
H  -7.324737 -0.611416 -3.369899
H  -4.862324 2.833114 -3.983333
H  -3.770799 -2.65663 1.529834
H  -3.579655 -3.311724 -0.100136
H  -1.907911 -1.238815 -1.416401
H  -1.636528 -2.786908 2.556105
H  0.456768 -0.673201 -1.378863
H  0.740644 -2.233293 2.607189
H  2.554051 -1.318557 1.660996
H  4.873713 0.027794 -0.433582
H  8.217837 2.653575 1.508311
H  9.251369 -1.358904 2.673809
H  9.899622 1.008073 2.302205
totalener: -2014.63101737 hartree
nucrepener: 3324.35760143 hartree
electener: -5338.98861881 hartree
oneelecener: -9367.81968388 hartree
twoeener: 4028.83106507 hartree
kineticenergy: 2007.73302184 hartree
xcener: -167.140246289600 hartree
chargesum: 0.0000000
charge: -0.077507 -0.188746 -0.176855 -0.217943 -0.404979 -0.376809 -0.142449 -0.190449 -0.176032 -0.080878 -0.120904 -0.164817 0.191316 0.024480 -0.135136 -0.195798 -0.151275 -0.148768 0.110179 0.092505 0.008803 -0.176643 -0.133152 0.174575 -0.169397 -0.182289 0.388899 -0.155788 0.377623 0.273009 0.297182 -0.222913 -0.221306 -0.045064 0.096508 0.079822 0.078205 0.079694 0.091517 0.119549 0.138552 0.118849 0.119184 0.080324 0.092836 0.117959 0.105270 0.149477 0.107695 0.175888 0.166367 0.131857 0.130138 0.137634
qa: -0.0775 -0.1887 -0.1769 -0.2179 -0.4050 -0.3768 -0.1424 -0.1904 -0.1760 -0.0809 -0.1209 -0.1648 0.1913 0.0245 -0.1351 -0.1958 -0.1513 -0.1488 0.1102 0.0925 0.0088 -0.1766 -0.1332 0.1746 -0.1694 -0.1823 0.3889 -0.1558 0.3776 0.2730 0.2972 -0.2229 -0.2213 -0.0451 0.0965 0.0798 0.0782 0.0797 0.0915 0.1195 0.1386 0.1188 0.1192 0.0803 0.0928 0.1180 0.1053 0.1495 0.1077 0.1759 0.1664 0.1319 0.1301 0.1376
va: 1.2293 1.1094 1.1336 1.9673 2.1076 2.1354 2.9196 3.2595 3.1984 3.8175 3.9351 3.9224 3.7642 3.6531 4.0085 4.0187 4.0201 4.0471 3.9135 3.8862 3.7043 3.9988 4.0396 3.9061 3.9802 4.0120 4.3217 3.5807 4.0942 3.9843 4.0018 3.9911 3.9913 3.8496 1.0053 1.0429 1.0182 1.0182 1.0180 1.0273 0.9970 1.0143 1.0158 1.0124 0.9919 1.0221 1.0112 1.0322 1.0167 1.0671 1.0291 1.0084 1.0093 0.9956
dispcorr: -0.025651184 hartree
energy: -2014.656668556101
dipole: -17.81820 19.77826 1.96006 2.89476 -2.36085 0.53390 13.15746 -12.20793 0.94953
magnitude: 2.24243 au
magnitude: 5.69981 debye
