program: Orca
programVersion: 5.0.2
elementType: Cl F F O O O N N N C C C C C C C C C C C C C C C C C C C C C C C C C H H H H H H H H H H H H H H H H H H H H
charge: 0
multiplicity: 1
keywords: wb97x-d3
keywords: def2-TZVPP
keywords: def2/J RIJCOSX
keywords: DEFGRID2
keywords: scfconv7
keywords: smallprint printgap noloewdin
keywords: NOSOSCF
formula: C25H20ClF2N3O3
InChI: InChI=1/C25H20ClF2N3O3/c26-18-10-8-17(9-11-18)23(16-6-7-16)31-34-14-15-4-12-19(13-5-15)29-25(33)30-24(32)22-20(27)2-1-3-21(22)28/h1-5,8-13,16,29-30H,6-7,14H2
54 atoms
Cl -6.411539 -1.091162 -5.628814
F  5.865059 -1.083942 3.501424
F  6.733154 1.697881 -0.138067
O  -4.302731 1.275584 0.05875
O  2.544461 -0.055264 -1.064547
O  4.229828 1.194774 2.51038
N  -4.271414 0.101338 0.758013
N  2.043292 0.986152 0.915628
N  4.190324 0.22674 0.446206
C  -4.508238 -2.23501 0.767412
C  -3.135919 -2.84907 0.93482
C  -3.889588 -2.353982 2.122022
C  -4.621983 -0.92077 0.086746
C  -5.072057 -0.929932 -1.323188
C  -4.574804 -1.901016 -2.190221
C  -6.004469 -0.017816 -1.815191
C  -4.97369 -1.953178 -3.515395
C  -6.42501 -0.071466 -3.132564
C  -5.899833 -1.034181 -3.979858
C  -3.522442 2.233458 0.737535
C  -2.060881 1.880767 0.760961
C  -1.446687 1.277792 -0.329745
C  -1.281972 2.160427 1.874806
C  0.675968 1.256212 0.795504
C  -0.097854 0.961718 -0.32618
C  0.067163 1.860907 1.893691
C  2.846493 0.373541 0.02252
C  6.250973 0.304668 1.668812
C  4.793158 0.633323 1.597826
C  6.736411 -0.533386 2.662479
C  7.179286 0.869468 0.808101
C  8.078928 -0.827879 2.787259
C  8.532204 0.614249 0.90285
C  8.969795 -0.245102 1.898658
H  -5.308511 -2.927799 0.530756
H  -2.289504 -2.262321 0.600222
H  -3.033937 -3.916236 0.784506
H  -4.319005 -3.083144 2.796037
H  -3.547812 -1.445656 2.597196
H  -3.853981 -2.623857 -1.830874
H  -6.424269 0.736089 -1.165466
H  -4.568109 -2.703392 -4.179808
H  -7.15558 0.6356 -3.500058
H  -3.68815 3.162454 0.186409
H  -3.892164 2.381171 1.758331
H  -2.029096 1.036082 -1.210339
H  -1.732739 2.612492 2.75037
H  0.339823 0.492118 -1.191461
H  0.651403 2.087097 2.778275
H  2.484127 1.270722 1.783624
H  4.751302 -0.252667 -0.241776
H  8.415641 -1.498624 3.565112
H  9.22316 1.08106 0.215186
H  10.025144 -0.462884 1.986039
totalener: -2014.63085233 hartree
nucrepener: 3328.94982147 hartree
electener: -5343.58067380 hartree
oneelecener: -9376.96337731 hartree
twoeener: 4033.38270351 hartree
kineticenergy: 2007.72704058 hartree
xcener: -167.139041787199 hartree
chargesum: -0.0000000
charge: -0.077295 -0.178726 -0.187458 -0.220681 -0.405620 -0.374488 -0.139177 -0.189404 -0.176210 -0.074211 -0.166404 -0.123228 0.184125 0.018858 -0.195575 -0.133308 -0.147588 -0.150366 0.110226 0.092016 0.018694 -0.181589 -0.136434 0.175046 -0.172346 -0.182417 0.389149 -0.153969 0.375118 0.295399 0.280164 -0.225925 -0.227711 -0.043343 0.095982 0.092426 0.079903 0.078806 0.080424 0.139432 0.120185 0.119398 0.119021 0.091786 0.081902 0.119817 0.105568 0.149927 0.107575 0.175386 0.166984 0.130635 0.132098 0.137423
qa: -0.0773 -0.1787 -0.1875 -0.2207 -0.4056 -0.3745 -0.1392 -0.1894 -0.1762 -0.0742 -0.1664 -0.1232 0.1841 0.0189 -0.1956 -0.1333 -0.1476 -0.1504 0.1102 0.0920 0.0187 -0.1816 -0.1364 0.1750 -0.1723 -0.1824 0.3891 -0.1540 0.3751 0.2954 0.2802 -0.2259 -0.2277 -0.0433 0.0960 0.0924 0.0799 0.0788 0.0804 0.1394 0.1202 0.1194 0.1190 0.0918 0.0819 0.1198 0.1056 0.1499 0.1076 0.1754 0.1670 0.1306 0.1321 0.1374
va: 1.2294 1.1312 1.1111 1.9689 2.1074 2.1385 2.9160 3.2601 3.1931 3.8110 3.9217 3.9365 3.7673 3.6495 4.0153 4.0051 4.0477 4.0194 3.9146 3.8870 3.6897 4.0030 4.0441 3.9041 3.9808 4.0130 4.3206 3.5786 4.0932 4.0050 3.9870 3.9953 3.9962 3.8465 1.0054 1.0173 1.0181 1.0182 1.0430 0.9967 1.0275 1.0157 1.0142 0.9913 1.0132 1.0203 1.0110 1.0325 1.0168 1.0677 1.0279 1.0089 1.0085 0.9957
dispcorr: -0.025867136 hartree
energy: -2014.656719461735
dipole: -18.70668 20.66094 1.95426 -4.61551 4.14679 -0.46872 13.06454 -12.23129 0.83325
magnitude: 2.17557 au
magnitude: 5.52987 debye
