program: Orca
programVersion: 5.0.2
elementType: Cl F F O O O N N N C C C C C C C C C C C C C C C C C C C C C C C C C H H H H H H H H H H H H H H H H H H H H
charge: 0
multiplicity: 1
keywords: wb97x-d3
keywords: def2-TZVPP
keywords: def2/J RIJCOSX
keywords: DEFGRID2
keywords: scfconv7
keywords: smallprint printgap noloewdin
keywords: NOSOSCF
formula: C25H20ClF2N3O3
InChI: InChI=1/C25H20ClF2N3O3/c26-18-10-8-17(9-11-18)23(16-6-7-16)31-34-14-15-4-12-19(13-5-15)29-25(33)30-24(32)22-20(27)2-1-3-21(22)28/h1-5,8-13,16,29-30H,6-7,14H2
54 atoms
Cl -2.184797 -1.051839 -4.962339
F  5.682552 1.083326 3.003344
F  4.593829 -1.655247 -0.615193
O  -5.099069 1.351603 0.145914
O  1.822715 1.951967 -1.195353
O  3.004531 0.009341 2.269047
N  -5.181848 0.259722 0.979936
N  1.072787 1.333632 0.880059
N  3.257132 0.911694 0.190777
C  -4.930745 -2.050805 1.217998
C  -5.224369 -3.375908 0.566793
C  -3.88366 -3.13104 1.163996
C  -4.789439 -0.814568 0.422453
C  -4.168826 -0.872514 -0.925002
C  -2.80796 -0.616338 -1.054249
C  -4.909863 -1.175331 -2.059905
C  -2.191682 -0.667258 -2.293246
C  -4.304544 -1.233328 -3.305744
C  -2.946561 -0.98008 -3.412215
C  -4.517626 2.43789 0.842754
C  -3.026223 2.275948 0.904117
C  -2.232137 2.661207 -0.167865
C  -2.41391 1.609509 1.958989
C  -0.277501 1.696707 0.835094
C  -0.874681 2.390975 -0.216551
C  -1.061224 1.32212 1.927842
C  1.983548 1.448046 -0.110501
C  5.092628 -0.260328 1.191085
C  3.678587 0.219084 1.286127
C  6.045135 0.178277 2.10059
C  5.497591 -1.200136 0.254946
C  7.349448 -0.270863 2.076669
C  6.788722 -1.684288 0.20013
C  7.709621 -1.207257 1.119567
H  -5.394332 -1.876728 2.181403
H  -5.292204 -3.416019 -0.512375
H  -5.914937 -4.032609 1.078616
H  -3.628959 -3.61587 2.096907
H  -3.048275 -3.000934 0.488364
H  -2.221177 -0.363774 -0.180071
H  -5.97363 -1.358692 -1.977577
H  -1.135658 -0.453542 -2.38552
H  -4.885621 -1.467222 -4.186894
H  -4.790228 3.328423 0.273702
H  -4.953355 2.523442 1.84368
H  -2.684382 3.173575 -1.008486
H  -3.003807 1.288214 2.808419
H  -0.29933 2.70674 -1.070517
H  -0.610577 0.789327 2.757525
H  1.390538 0.8703 1.72431
H  3.911426 1.049664 -0.564778
H  8.06435 0.106437 2.794243
H  7.060531 -2.420537 -0.542997
H  8.726761 -1.572363 1.09024
totalener: -2014.62711833 hartree
nucrepener: 3506.60826099 hartree
electener: -5521.23537932 hartree
oneelecener: -9732.05634679 hartree
twoeener: 4210.82096747 hartree
kineticenergy: 2007.73505584 hartree
xcener: -167.138414691661 hartree
chargesum: -0.0000000
charge: -0.078886 -0.178306 -0.187333 -0.202426 -0.405742 -0.374172 -0.122292 -0.184472 -0.175773 -0.044663 -0.145335 -0.142641 0.152999 0.142130 -0.318366 -0.219780 -0.100924 -0.113234 0.074393 0.079731 -0.082543 -0.068850 -0.112877 0.181626 -0.229680 -0.189667 0.392824 -0.153918 0.374817 0.297215 0.277518 -0.225255 -0.225076 -0.044012 0.073769 0.082958 0.083255 0.081184 0.086986 0.170576 0.129068 0.122267 0.119359 0.088658 0.088201 0.108578 0.115485 0.149941 0.106912 0.176479 0.168361 0.130968 0.132105 0.137860
qa: -0.0789 -0.1783 -0.1873 -0.2024 -0.4057 -0.3742 -0.1223 -0.1845 -0.1758 -0.0447 -0.1453 -0.1426 0.1530 0.1421 -0.3184 -0.2198 -0.1009 -0.1132 0.0744 0.0797 -0.0825 -0.0688 -0.1129 0.1816 -0.2297 -0.1897 0.3928 -0.1539 0.3748 0.2972 0.2775 -0.2253 -0.2251 -0.0440 0.0738 0.0830 0.0833 0.0812 0.0870 0.1706 0.1291 0.1223 0.1194 0.0887 0.0882 0.1086 0.1155 0.1499 0.1069 0.1765 0.1684 0.1310 0.1321 0.1379
va: 1.2284 1.1317 1.1112 1.9460 2.1007 2.1375 2.8935 3.2445 3.1949 3.8578 3.9072 3.8895 3.7577 3.4842 4.0332 4.0088 3.9880 3.9898 3.9511 3.9194 3.7024 3.9292 3.9497 3.8258 3.9900 3.9895 4.3091 3.5775 4.0937 4.0051 3.9892 3.9956 3.9946 3.8478 1.0377 1.0229 1.0208 1.0214 1.0217 0.9662 1.0094 1.0184 1.0132 0.9961 1.0140 1.0126 1.0229 1.0339 1.0180 1.0659 1.0268 1.0090 1.0084 0.9956
dispcorr: -0.029582509 hartree
energy: -2014.656700837744
dipole: -28.18836 30.13256 1.94420 -5.01653 4.10693 -0.90960 11.45608 -10.80485 0.65123
magnitude: 2.24308 au
magnitude: 5.70145 debye
