program: Orca
programVersion: 5.0.2
elementType: Cl F F O O O N N N C C C C C C C C C C C C C C C C C C C C C C C C C H H H H H H H H H H H H H H H H H H H H
charge: 0
multiplicity: 1
keywords: wb97x-d3
keywords: def2-TZVPP
keywords: def2/J RIJCOSX
keywords: DEFGRID2
keywords: scfconv7
keywords: smallprint printgap noloewdin
keywords: NOSOSCF
formula: C25H20ClF2N3O3
InChI: InChI=1/C25H20ClF2N3O3/c26-18-10-8-17(9-11-18)23(16-6-7-16)31-34-14-15-4-12-19(13-5-15)29-25(33)30-24(32)22-20(27)2-1-3-21(22)28/h1-5,8-13,16,29-30H,6-7,14H2
54 atoms
Cl -2.08678 -1.394921 -4.752647
F  4.950442 -1.305971 2.981351
F  5.720799 1.459834 -0.699296
O  -5.023571 1.345762 0.146704
O  1.306529 0.302214 -1.20024
O  3.466205 1.138675 2.230818
N  -5.078657 0.328935 1.077176
N  1.150014 1.349008 0.825492
N  3.120566 0.314468 0.133539
C  -4.765865 -1.942696 1.52205
C  -5.076498 -3.315423 0.98738
C  -3.722744 -3.027603 1.533246
C  -4.654802 -0.779762 0.618632
C  -4.039729 -0.944384 -0.722183
C  -4.801359 -1.252043 -1.842251
C  -2.667036 -0.774826 -0.862845
C  -4.203143 -1.396354 -3.083829
C  -2.055542 -0.90899 -2.098974
C  -2.833138 -1.222405 -3.201809
C  -4.430246 2.485991 0.735422
C  -2.939305 2.314592 0.80076
C  -2.318519 1.832857 1.945411
C  -2.167068 2.498988 -0.340949
C  -0.213649 1.688393 0.786579
C  -0.96899 1.51819 1.941396
C  -0.816447 2.203485 -0.356665
C  1.77864 0.652946 -0.145338
C  5.284802 0.09253 1.142905
C  3.873499 0.578831 1.238794
C  5.781773 -0.81591 2.06801
C  6.172419 0.57496 0.192247
C  7.09242 -1.246283 2.04807
C  7.494516 0.182474 0.143076
C  7.942909 -0.735168 1.080105
H  -5.207342 -1.689502 2.478268
H  -5.168781 -3.439094 -0.083757
H  -5.75678 -3.926417 1.565285
H  -3.450033 -3.434591 2.49773
H  -2.901572 -2.958892 0.832007
H  -5.873408 -1.370784 -1.750784
H  -2.062039 -0.5211 -0.001429
H  -4.798889 -1.63313 -3.954293
H  -0.989363 -0.754337 -2.194217
H  -4.700641 3.322881 0.089068
H  -4.85432 2.668095 1.728593
H  -2.900286 1.669311 2.843968
H  -2.63326 2.863019 -1.248166
H  -0.505165 1.116103 2.833987
H  -0.24234 2.356221 -1.257988
H  1.656349 1.493434 1.691067
H  3.548454 -0.196625 -0.623616
H  7.435902 -1.965615 2.777794
H  8.153884 0.590644 -0.609732
H  8.974099 -1.058761 1.055464
totalener: -2014.62656907 hartree
nucrepener: 3526.89364852 hartree
electener: -5541.52021759 hartree
oneelecener: -9772.96495890 hartree
twoeener: 4231.44474131 hartree
kineticenergy: 2007.74903370 hartree
xcener: -167.139034588035 hartree
chargesum: -0.0000000
charge: -0.079503 -0.178488 -0.187968 -0.203434 -0.420125 -0.372658 -0.122751 -0.219427 -0.172517 -0.046491 -0.145951 -0.139900 0.165454 0.155349 -0.215475 -0.362155 -0.110957 -0.102340 0.066014 0.084213 -0.077600 -0.101006 -0.075421 0.193693 -0.192787 -0.194320 0.394185 -0.156692 0.380629 0.296599 0.275251 -0.224034 -0.223771 -0.044794 0.073386 0.083396 0.081963 0.080132 0.087912 0.124232 0.171995 0.117453 0.147604 0.090400 0.086408 0.113605 0.110606 0.117140 0.123406 0.179148 0.169387 0.130501 0.132618 0.137885
qa: -0.0795 -0.1785 -0.1880 -0.2034 -0.4201 -0.3727 -0.1228 -0.2194 -0.1725 -0.0465 -0.1460 -0.1399 0.1655 0.1553 -0.2155 -0.3622 -0.1110 -0.1023 0.0660 0.0842 -0.0776 -0.1010 -0.0754 0.1937 -0.1928 -0.1943 0.3942 -0.1567 0.3806 0.2966 0.2753 -0.2240 -0.2238 -0.0448 0.0734 0.0834 0.0820 0.0801 0.0879 0.1242 0.1720 0.1175 0.1476 0.0904 0.0864 0.1136 0.1106 0.1171 0.1234 0.1791 0.1694 0.1305 0.1326 0.1379
va: 1.2297 1.1313 1.1104 1.9438 2.0793 2.1353 2.8892 3.2028 3.1844 3.8604 3.9088 3.8888 3.7540 3.4390 4.0095 4.0409 3.9746 3.9590 3.9635 3.9195 3.7145 3.9496 3.9339 3.6736 4.0712 4.0160 4.3040 3.5693 4.0943 4.0014 3.9875 3.9939 3.9945 3.8501 1.0374 1.0223 1.0210 1.0211 1.0224 1.0121 0.9763 1.0141 1.0214 0.9964 1.0144 1.0212 1.0132 1.0161 1.0250 1.0634 1.0264 1.0091 1.0083 0.9956
dispcorr: -0.030603772 hartree
energy: -2014.657172838106
dipole: -28.11716 30.14959 2.03242 -4.60332 3.92640 -0.67693 12.27887 -11.58180 0.69707
magnitude: 2.25275 au
magnitude: 5.72603 debye
