program: Orca
programVersion: 5.0.2
elementType: Cl F F O O O N N N C C C C C C C C C C C C C C C C C C C C C C C C C H H H H H H H H H H H H H H H H H H H H
charge: 0
multiplicity: 1
keywords: wb97x-d3
keywords: def2-TZVPP
keywords: def2/J RIJCOSX
keywords: DEFGRID2
keywords: scfconv7
keywords: smallprint printgap noloewdin
keywords: NOSOSCF
formula: C25H20ClF2N3O3
InChI: InChI=1/C25H20ClF2N3O3/c26-18-10-8-17(9-11-18)23(16-6-7-16)31-34-14-15-4-12-19(13-5-15)29-25(33)30-24(32)22-20(27)2-1-3-21(22)28/h1-5,8-13,16,29-30H,6-7,14H2
54 atoms
Cl -2.826363 -1.596099 -5.020702
F  5.839882 1.307611 3.062337
F  5.001402 -1.389795 -0.643624
O  -4.9046 1.314132 0.226096
O  2.145768 2.319191 -1.106013
O  3.221429 0.018862 2.168001
N  -4.930677 0.290408 1.142908
N  1.310805 1.38465 0.81354
N  3.548852 1.163638 0.223378
C  -4.713238 -2.000506 1.540213
C  -5.077032 -3.377861 1.056328
C  -3.676394 -3.089491 1.467546
C  -4.648847 -0.838936 0.629862
C  -4.216721 -1.02381 -0.777696
C  -5.095348 -1.4824 -1.750669
C  -2.904324 -0.73111 -1.134707
C  -4.674255 -1.659825 -3.059482
C  -2.470829 -0.906133 -2.437845
C  -3.361047 -1.372836 -3.392152
C  -4.288723 2.446521 0.811525
C  -2.797169 2.27754 0.843605
C  -2.173187 1.619618 1.897888
C  -2.014354 2.657717 -0.238225
C  -0.043651 1.727476 0.764744
C  -0.81893 1.346307 1.861072
C  -0.653651 2.400483 -0.292651
C  2.268766 1.679459 -0.09045
C  5.381629 -0.023256 1.206944
C  3.940296 0.374757 1.261954
C  6.279847 0.438946 2.156392
C  5.858154 -0.920999 0.265187
C  7.603102 0.047752 2.170089
C  7.170578 -1.346885 0.245224
C  8.036466 -0.851768 1.207621
H  -5.060635 -1.734445 2.531095
H  -5.269324 -3.523674 0.001742
H  -5.700975 -3.976537 1.706322
H  -3.311496 -3.487308 2.404889
H  -2.926674 -3.026975 0.689229
H  -6.125281 -1.693285 -1.492352
H  -2.213065 -0.355721 -0.390466
H  -5.362983 -2.013233 -3.8141
H  -1.450296 -0.673851 -2.708771
H  -4.571538 3.290602 0.18046
H  -4.691244 2.618075 1.815211
H  -2.754752 1.300844 2.753697
H  -2.47654 3.16146 -1.078756
H  -0.356796 0.828201 2.693669
H  -0.083343 2.717534 -1.149834
H  1.610678 0.842587 1.616659
H  4.241375 1.417692 -0.465099
H  8.275408 0.438339 2.920673
H  7.501082 -2.052227 -0.503976
H  9.069074 -1.171925 1.206839
totalener: -2014.62809521 hartree
nucrepener: 3464.54394734 hartree
electener: -5479.17204256 hartree
oneelecener: -9647.85453188 hartree
twoeener: 4168.68248932 hartree
kineticenergy: 2007.74992596 hartree
xcener: -167.140679795424 hartree
chargesum: 0.0000000
charge: -0.079956 -0.180432 -0.187109 -0.202601 -0.402326 -0.373337 -0.123606 -0.186405 -0.174390 -0.039419 -0.141267 -0.145395 0.150877 0.116746 -0.222737 -0.258205 -0.116922 -0.110687 0.081309 0.080806 -0.074582 -0.121579 -0.105268 0.173548 -0.173966 -0.198443 0.388994 -0.156189 0.372603 0.302508 0.283483 -0.230317 -0.229246 -0.042992 0.074046 0.081889 0.082237 0.080931 0.085651 0.132997 0.141847 0.119732 0.121772 0.087305 0.090114 0.116263 0.107703 0.107296 0.150984 0.176876 0.168236 0.131011 0.131916 0.137693
qa: -0.0800 -0.1804 -0.1871 -0.2026 -0.4023 -0.3733 -0.1236 -0.1864 -0.1744 -0.0394 -0.1413 -0.1454 0.1509 0.1167 -0.2227 -0.2582 -0.1169 -0.1107 0.0813 0.0808 -0.0746 -0.1216 -0.1053 0.1735 -0.1740 -0.1984 0.3890 -0.1562 0.3726 0.3025 0.2835 -0.2303 -0.2292 -0.0430 0.0740 0.0819 0.0822 0.0809 0.0857 0.1330 0.1418 0.1197 0.1218 0.0873 0.0901 0.1163 0.1077 0.1073 0.1510 0.1769 0.1682 0.1310 0.1319 0.1377
va: 1.2263 1.1283 1.1115 1.9521 2.1094 2.1391 2.8898 3.2471 3.1924 3.8525 3.9070 3.8915 3.7651 3.5158 4.0079 4.0371 4.0011 3.9995 3.9330 3.9082 3.6827 3.9627 3.9581 3.8648 3.9808 3.9889 4.3170 3.5770 4.0935 4.0027 3.9914 4.0001 3.9991 3.8458 1.0368 1.0235 1.0210 1.0215 1.0212 1.0068 0.9860 1.0133 1.0141 0.9963 1.0134 1.0259 1.0134 1.0176 1.0320 1.0670 1.0261 1.0089 1.0084 0.9956
dispcorr: -0.028670314 hartree
energy: -2014.656765527853
dipole: -26.73085 28.68639 1.95554 -4.41741 3.58421 -0.83321 12.80758 -12.10012 0.70746
magnitude: 2.24028 au
magnitude: 5.69434 debye
