program: Orca
programVersion: 5.0.2
elementType: Cl F F O O O N N N C C C C C C C C C C C C C C C C C C C C C C C C C H H H H H H H H H H H H H H H H H H H H
charge: 0
multiplicity: 1
keywords: wb97x-d3
keywords: def2-TZVPP
keywords: def2/J RIJCOSX
keywords: DEFGRID2
keywords: scfconv7
keywords: smallprint printgap noloewdin
keywords: NOSOSCF
formula: C25H20ClF2N3O3
InChI: InChI=1/C25H20ClF2N3O3/c26-18-10-8-17(9-11-18)23(16-6-7-16)31-34-14-15-4-12-19(13-5-15)29-25(33)30-24(32)22-20(27)2-1-3-21(22)28/h1-5,8-13,16,29-30H,6-7,14H2
54 atoms
Cl -3.31676 -1.205313 -5.311013
F  4.908482 -2.123872 1.711244
F  6.254102 2.283571 0.989408
O  -4.833456 1.209421 0.337759
O  2.090194 1.826979 -1.20645
O  3.446697 0.368613 2.424181
N  -4.823808 0.109495 1.158618
N  1.412498 1.364486 0.933813
N  3.604966 1.00012 0.24048
C  -4.671848 -2.215504 1.326758
C  -5.145276 -3.528071 0.763305
C  -3.698149 -3.328796 1.047735
C  -4.640409 -0.976594 0.522596
C  -4.33591 -1.038728 -0.928284
C  -5.294274 -1.413864 -1.860475
C  -3.058961 -0.704709 -1.36927
C  -4.987108 -1.467812 -3.211645
C  -2.73903 -0.755824 -2.714845
C  -3.708282 -1.139749 -3.628765
C  -4.213903 2.295953 0.999553
C  -2.720341 2.140452 1.004448
C  -1.961664 2.526732 -0.093176
C  -2.067247 1.505155 2.053911
C  0.04424 1.652188 0.89198
C  -0.596654 2.297992 -0.164452
C  -0.706923 1.264599 2.0022
C  2.298481 1.441445 -0.082009
C  5.532329 0.092978 1.349168
C  4.094622 0.504652 1.410808
C  5.883219 -1.234659 1.550991
C  6.566153 0.999342 1.171932
C  7.196031 -1.658466 1.561976
C  7.893973 0.622869 1.185705
C  8.19642 -0.715529 1.381187
H  -4.906881 -2.030046 2.367783
H  -5.452508 -3.571211 -0.272919
H  -5.724387 -4.161403 1.421967
H  -3.257125 -3.827033 1.900575
H  -3.030308 -3.216504 0.20325
H  -6.299213 -1.652732 -1.536471
H  -2.306178 -0.393284 -0.655946
H  -5.738977 -1.756068 -3.93299
H  -1.745184 -0.492445 -3.049351
H  -4.511299 3.182129 0.436337
H  -4.603945 2.390899 2.018214
H  -2.446523 3.0149 -0.930242
H  -2.63069 1.178278 2.918805
H  -0.046573 2.618588 -1.033615
H  -0.222928 0.760629 2.830978
H  1.771752 0.992915 1.806663
H  4.228763 1.05679 -0.55052
H  7.425785 -2.704173 1.710201
H  8.6691 1.364028 1.051036
H  9.230622 -1.030287 1.391834
totalener: -2014.62876584 hartree
nucrepener: 3435.06626688 hartree
electener: -5449.69503272 hartree
oneelecener: -9588.98148554 hartree
twoeener: 4139.28645282 hartree
kineticenergy: 2007.73554388 hartree
xcener: -167.137660473753 hartree
chargesum: -0.0000000
charge: -0.079680 -0.179622 -0.187465 -0.201803 -0.403517 -0.373826 -0.121592 -0.192776 -0.175922 -0.041804 -0.140123 -0.143377 0.161726 0.103100 -0.220604 -0.249198 -0.120922 -0.107670 0.080605 0.082496 -0.082855 -0.129228 -0.101483 0.188908 -0.188260 -0.179874 0.389477 -0.156743 0.374822 0.294727 0.285390 -0.225731 -0.228502 -0.043031 0.073591 0.079595 0.081897 0.080901 0.085054 0.133825 0.131828 0.119149 0.124456 0.089203 0.087965 0.109324 0.114837 0.147778 0.108682 0.177239 0.168672 0.130907 0.131707 0.137747
qa: -0.0797 -0.1796 -0.1875 -0.2018 -0.4035 -0.3738 -0.1216 -0.1928 -0.1759 -0.0418 -0.1401 -0.1434 0.1617 0.1031 -0.2206 -0.2492 -0.1209 -0.1077 0.0806 0.0825 -0.0829 -0.1292 -0.1015 0.1889 -0.1883 -0.1799 0.3895 -0.1567 0.3748 0.2947 0.2854 -0.2257 -0.2285 -0.0430 0.0736 0.0796 0.0819 0.0809 0.0851 0.1338 0.1318 0.1191 0.1245 0.0892 0.0880 0.1093 0.1148 0.1478 0.1087 0.1772 0.1687 0.1309 0.1317 0.1377
va: 1.2266 1.1297 1.1110 1.9548 2.1068 2.1389 2.8986 3.2498 3.1938 3.8573 3.9057 3.8909 3.7648 3.5276 4.0174 4.0378 4.0051 3.9827 3.9310 3.9088 3.6938 3.9561 3.9622 3.8517 3.9885 4.0078 4.3194 3.5773 4.0951 4.0046 3.9860 3.9970 3.9961 3.8467 1.0362 1.0247 1.0209 1.0213 1.0208 1.0055 0.9994 1.0137 1.0130 0.9960 1.0132 1.0146 1.0232 1.0318 1.0166 1.0666 1.0265 1.0088 1.0087 0.9957
dispcorr: -0.028035984 hartree
energy: -2014.656801821571
dipole: -26.28656 28.24412 1.95756 -6.45837 5.59326 -0.86511 12.16470 -11.47301 0.69169
magnitude: 2.24920 au
magnitude: 5.71702 debye
