program: Orca
programVersion: 5.0.2
elementType: Cl F F O O O N N N C C C C C C C C C C C C C C C C C C C C C C C C C H H H H H H H H H H H H H H H H H H H H
charge: 0
multiplicity: 1
keywords: wb97x-d3
keywords: def2-TZVPP
keywords: def2/J RIJCOSX
keywords: DEFGRID2
keywords: scfconv7
keywords: smallprint printgap noloewdin
keywords: NOSOSCF
formula: C25H20ClF2N3O3
InChI: InChI=1/C25H20ClF2N3O3/c26-18-10-8-17(9-11-18)23(16-6-7-16)31-34-14-15-4-12-19(13-5-15)29-25(33)30-24(32)22-20(27)2-1-3-21(22)28/h1-5,8-13,16,29-30H,6-7,14H2
54 atoms
Cl -6.324697 -1.020063 -5.686476
F  6.193262 -2.090965 1.073824
F  6.663553 2.464753 1.938705
O  -4.129267 0.950382 0.161455
O  2.965742 2.118063 -0.929732
O  4.191713 -0.125222 2.336427
N  -4.046787 -0.280238 0.737464
N  2.173427 1.059737 0.942457
N  4.437492 1.059523 0.403423
C  -4.49761 -2.585685 0.613809
C  -4.177563 -2.795408 2.056967
C  -5.593004 -2.914324 1.601748
C  -4.449945 -1.234377 -0.000463
C  -4.908643 -1.128437 -1.404596
C  -6.049761 -1.823561 -1.798069
C  -4.209366 -0.401762 -2.367408
C  -6.499122 -1.786667 -3.107478
C  -4.637736 -0.372976 -3.683035
C  -5.785541 -1.060645 -4.045682
C  -3.466891 1.899336 0.980097
C  -1.977455 1.723145 0.972561
C  -1.340067 0.962754 1.945618
C  -1.198137 2.266835 -0.039889
C  0.799698 1.316174 0.887731
C  0.025985 0.763515 1.908927
C  0.173493 2.077579 -0.09757
C  3.122155 1.46501 0.072587
C  6.382265 0.192865 1.501679
C  4.893352 0.350408 1.472974
C  6.975248 -1.050763 1.345946
C  7.219221 1.264288 1.770297
C  8.340115 -1.233023 1.436933
C  8.588153 1.129078 1.877886
C  9.13801 -0.131856 1.707652
H  -4.224681 -3.384409 -0.06699
H  -3.900334 -1.927597 2.637727
H  -3.64578 -3.700654 2.317125
H  -6.046244 -3.895993 1.551705
H  -6.274894 -2.116394 1.866396
H  -6.605024 -2.399578 -1.069224
H  -3.310232 0.133687 -2.098786
H  -7.393376 -2.321568 -3.395257
H  -4.08146 0.183628 -4.424374
H  -3.745297 2.866843 0.559134
H  -3.85898 1.849892 2.000799
H  -1.920849 0.513238 2.740758
H  -1.667913 2.86414 -0.812824
H  0.498556 0.167781 2.681494
H  0.740964 2.521134 -0.898444
H  2.498195 0.501659 1.724479
H  5.114099 1.384316 -0.271073
H  8.764365 -2.21742 1.299672
H  9.203625 1.990618 2.094698
H  10.208605 -0.259138 1.786229
totalener: -2014.63086714 hartree
nucrepener: 3295.12237332 hartree
electener: -5309.75324046 hartree
oneelecener: -9309.20309539 hartree
twoeener: 3999.44985493 hartree
kineticenergy: 2007.73729045 hartree
xcener: -167.139027427157 hartree
chargesum: -0.0000000
charge: -0.078733 -0.180405 -0.187147 -0.208255 -0.404054 -0.373790 -0.141830 -0.188775 -0.174567 -0.096408 -0.125185 -0.165914 0.216810 0.033885 -0.202753 -0.138648 -0.146246 -0.150323 0.110104 0.063079 -0.056483 -0.084134 -0.142544 0.181965 -0.199521 -0.171985 0.389461 -0.155630 0.371999 0.304062 0.281286 -0.230852 -0.228510 -0.043516 0.099619 0.075354 0.080298 0.079514 0.085985 0.137168 0.123831 0.118243 0.118231 0.093125 0.086729 0.110233 0.112872 0.107317 0.151384 0.175848 0.167725 0.130684 0.132089 0.137306
qa: -0.0787 -0.1804 -0.1871 -0.2083 -0.4041 -0.3738 -0.1418 -0.1888 -0.1746 -0.0964 -0.1252 -0.1659 0.2168 0.0339 -0.2028 -0.1386 -0.1462 -0.1503 0.1101 0.0631 -0.0565 -0.0841 -0.1425 0.1820 -0.1995 -0.1720 0.3895 -0.1556 0.3720 0.3041 0.2813 -0.2309 -0.2285 -0.0435 0.0996 0.0754 0.0803 0.0795 0.0860 0.1372 0.1238 0.1182 0.1182 0.0931 0.0867 0.1102 0.1129 0.1073 0.1514 0.1758 0.1677 0.1307 0.1321 0.1373
va: 1.2279 1.1281 1.1114 1.9689 2.1082 2.1386 2.9113 3.2604 3.1919 3.8436 3.9381 3.9306 3.7591 3.6723 4.0228 4.0267 4.0438 4.0269 3.9090 3.9105 3.7062 3.9905 3.9828 3.9018 4.0318 4.0082 4.3179 3.5795 4.0967 4.0017 3.9917 3.9986 3.9985 3.8456 1.0051 1.0419 1.0181 1.0190 1.0190 0.9969 1.0155 1.0161 1.0147 0.9976 1.0106 1.0157 1.0112 1.0165 1.0313 1.0664 1.0265 1.0091 1.0082 0.9957
dispcorr: -0.025253165 hartree
energy: -2014.656120308059
dipole: -23.31280 25.25562 1.94282 -5.69377 5.13808 -0.55568 14.86833 -14.04273 0.82561
magnitude: 2.18288 au
magnitude: 5.54843 debye
