program: Orca
programVersion: 5.0.2
elementType: Cl F F O O O N N N C C C C C C C C C C C C C C C C C C C C C C C C C H H H H H H H H H H H H H H H H H H H H
charge: 0
multiplicity: 1
keywords: wb97x-d3
keywords: def2-TZVPP
keywords: def2/J RIJCOSX
keywords: DEFGRID2
keywords: scfconv7
keywords: smallprint printgap noloewdin
keywords: NOSOSCF
formula: C25H20ClF2N3O3
InChI: InChI=1/C25H20ClF2N3O3/c26-18-10-8-17(9-11-18)23(16-6-7-16)31-34-14-15-4-12-19(13-5-15)29-25(33)30-24(32)22-20(27)2-1-3-21(22)28/h1-5,8-13,16,29-30H,6-7,14H2
54 atoms
Cl -8.941828 -0.877855 2.711215
F  7.11643 2.515698 0.169466
F  6.557619 -2.106586 0.311336
O  -3.798298 1.003114 -0.865142
O  2.848936 1.733236 2.086897
O  4.864705 0.040571 -1.120368
N  -3.517084 -0.207655 -1.417895
N  2.546794 0.991095 -0.06103
N  4.624845 0.901777 0.978549
C  -4.088496 -2.469563 -1.708495
C  -4.40413 -2.642777 -3.176255
C  -2.991903 -2.67977 -2.700231
C  -4.299643 -1.146331 -1.065867
C  -5.430374 -1.040443 -0.116589
C  -5.324247 -0.392584 1.112986
C  -6.642277 -1.644424 -0.445318
C  -6.396535 -0.350142 1.987334
C  -7.728086 -1.591658 0.412131
C  -7.597207 -0.942506 1.628201
C  -2.910345 1.978096 -1.38582
C  -1.477244 1.738443 -1.014769
C  -1.001778 2.042352 0.254062
C  -0.58973 1.176037 -1.923105
C  1.196342 1.259332 -0.304538
C  0.314722 1.813842 0.622044
C  0.726896 0.942345 -1.579281
C  3.254091 1.249884 1.058309
C  6.794185 0.209066 0.236638
C  5.334232 0.369655 -0.054721
C  7.646033 1.299412 0.306293
C  7.361722 -1.049098 0.363975
C  9.005718 1.166798 0.501587
C  8.71435 -1.23093 0.567886
C  9.52883 -0.110475 0.631572
H  -4.33473 -3.310494 -1.069873
H  -4.731303 -1.762247 -3.714214
H  -4.87493 -3.564812 -3.492354
H  -2.484253 -3.634793 -2.676655
H  -2.353866 -1.835673 -2.919989
H  -4.393269 0.070869 1.405231
H  -6.746452 -2.156827 -1.393068
H  -6.300069 0.145026 2.943548
H  -8.666543 -2.052477 0.137065
H  -3.015977 2.037824 -2.474152
H  -3.269303 2.919387 -0.965813
H  -1.672544 2.477765 0.985632
H  -0.932758 0.914937 -2.916282
H  0.644806 2.070172 1.615043
H  1.400347 0.508064 -2.3091
H  3.065104 0.567654 -0.823095
H  5.119693 1.111292 1.832552
H  9.636377 2.04342 0.54481
H  9.117127 -2.228483 0.672341
H  10.591445 -0.235567 0.785875
totalener: -2014.63048957 hartree
nucrepener: 3270.59120791 hartree
electener: -5285.22169747 hartree
oneelecener: -9260.16912439 hartree
twoeener: 3974.94742691 hartree
kineticenergy: 2007.73451768 hartree
xcener: -167.138819588189 hartree
chargesum: 0.0000000
charge: -0.078897 -0.186914 -0.180857 -0.210334 -0.403210 -0.373567 -0.138872 -0.188821 -0.173899 -0.110066 -0.157390 -0.121425 0.224252 0.025918 -0.135214 -0.199877 -0.149371 -0.150175 0.110479 0.065599 -0.047625 -0.123010 -0.100276 0.179643 -0.180353 -0.191335 0.387470 -0.156957 0.370993 0.283201 0.305226 -0.229748 -0.231718 -0.042962 0.100992 0.084085 0.078832 0.079447 0.077216 0.121199 0.135762 0.118624 0.118627 0.083010 0.095251 0.110535 0.106032 0.149381 0.107413 0.176142 0.167881 0.131846 0.130868 0.136949
qa: -0.0789 -0.1869 -0.1809 -0.2103 -0.4032 -0.3736 -0.1389 -0.1888 -0.1739 -0.1101 -0.1574 -0.1214 0.2243 0.0259 -0.1352 -0.1999 -0.1494 -0.1502 0.1105 0.0656 -0.0476 -0.1230 -0.1003 0.1796 -0.1804 -0.1913 0.3875 -0.1570 0.3710 0.2832 0.3052 -0.2297 -0.2317 -0.0430 0.1010 0.0841 0.0788 0.0794 0.0772 0.1212 0.1358 0.1186 0.1186 0.0830 0.0953 0.1105 0.1060 0.1494 0.1074 0.1761 0.1679 0.1318 0.1309 0.1369
va: 1.2277 1.1120 1.1273 1.9687 2.1096 2.1388 2.9149 3.2585 3.1917 3.8478 3.9256 3.9402 3.7495 3.6806 4.0171 4.0216 4.0199 4.0437 3.9125 3.9110 3.7227 3.9912 4.0023 3.9037 4.0147 4.0225 4.3196 3.5806 4.0968 3.9941 4.0009 3.9980 4.0017 3.8449 1.0046 1.0209 1.0192 1.0186 1.0393 1.0222 0.9986 1.0145 1.0158 1.0072 0.9969 1.0124 1.0153 1.0315 1.0167 1.0670 1.0261 1.0083 1.0089 0.9958
dispcorr: -0.024991600 hartree
energy: -2014.655481166829
dipole: -14.88857 17.03780 2.14924 -5.15682 4.67378 -0.48304 -17.59140 17.23663 -0.35477
magnitude: 2.23123 au
magnitude: 5.67135 debye
