program: Orca
programVersion: 5.0.2
elementType: Cl F F O O O N N N C C C C C C C C C C C C C C C C C C C C C C C C C H H H H H H H H H H H H H H H H H H H H
charge: 0
multiplicity: 1
keywords: wb97x-d3
keywords: def2-TZVPP
keywords: def2/J RIJCOSX
keywords: DEFGRID2
keywords: scfconv7
keywords: smallprint printgap noloewdin
keywords: NOSOSCF
formula: C25H20ClF2N3O3
InChI: InChI=1/C25H20ClF2N3O3/c26-18-10-8-17(9-11-18)23(16-6-7-16)31-34-14-15-4-12-19(13-5-15)29-25(33)30-24(32)22-20(27)2-1-3-21(22)28/h1-5,8-13,16,29-30H,6-7,14H2
54 atoms
Cl -5.65056 -0.39816 -5.818655
F  6.428444 1.887675 2.612519
F  5.502709 -2.233132 0.634857
O  -4.547574 1.277378 0.383214
O  2.322753 0.679661 -1.168684
O  3.867897 0.369053 2.659058
N  -4.425409 0.015274 0.899228
N  1.757088 0.868939 1.045846
N  3.917612 0.325015 0.381507
C  -4.328942 -2.30182 0.541039
C  -2.901427 -2.741488 0.782515
C  -3.835663 -2.552706 1.928567
C  -4.56337 -0.920686 0.048821
C  -4.853257 -0.761572 -1.39333
C  -5.816708 0.12445 -1.873754
C  -4.15313 -1.541073 -2.312633
C  -6.070393 0.230876 -3.230399
C  -4.386069 -1.431295 -3.672955
C  -5.346763 -0.541863 -4.124531
C  -3.79735 2.163689 1.187522
C  -2.326627 1.858372 1.130343
C  -1.696116 1.636381 -0.088231
C  -1.567244 1.747094 2.285705
C  0.400655 1.205705 1.000461
C  -0.352448 1.312342 -0.16875
C  -0.221649 1.434148 2.226258
C  2.587653 0.639923 0.008037
C  5.919629 -0.157058 1.615398
C  4.466552 0.198045 1.620761
C  6.852626 0.710013 2.166487
C  6.386709 -1.376112 1.149267
C  8.195193 0.400398 2.23902
C  7.718585 -1.733013 1.210502
C  8.616543 -0.829996 1.758203
H  -4.98822 -3.047775 0.110517
H  -2.127451 -1.997653 0.638844
H  -2.623106 -3.746657 0.492539
H  -4.211883 -3.433643 2.43139
H  -3.687457 -1.695042 2.568778
H  -6.391618 0.729544 -1.188297
H  -3.401297 -2.237059 -1.964759
H  -6.825769 0.915123 -3.590845
H  -3.824643 -2.031852 -4.374992
H  -4.013056 3.155028 0.782647
H  -4.151082 2.138776 2.224146
H  -2.266688 1.699245 -1.006949
H  -2.031207 1.895143 3.253445
H  0.097437 1.142967 -1.132951
H  0.347531 1.351033 3.144997
H  2.173469 0.796093 1.968115
H  4.51247 0.181801 -0.420654
H  8.89146 1.109186 2.664566
H  8.039907 -2.69686 0.841923
H  9.664612 -1.089664 1.811953
totalener: -2014.63013457 hartree
nucrepener: 3370.31385563 hartree
electener: -5384.94399020 hartree
oneelecener: -9459.68611813 hartree
twoeener: 4074.74212793 hartree
kineticenergy: 2007.73480110 hartree
xcener: -167.139785183884 hartree
chargesum: -0.0000000
charge: -0.077299 -0.178855 -0.187804 -0.222757 -0.404200 -0.374380 -0.136355 -0.188370 -0.175698 -0.068354 -0.164194 -0.123369 0.178622 0.011869 -0.133934 -0.189947 -0.146977 -0.150035 0.110393 0.092830 -0.010363 -0.166095 -0.128823 0.173357 -0.173412 -0.180562 0.387950 -0.157104 0.375863 0.297313 0.282138 -0.227118 -0.228496 -0.042332 0.097354 0.092029 0.079793 0.078588 0.078472 0.120566 0.139199 0.118885 0.118981 0.095614 0.079886 0.118085 0.106488 0.151205 0.108059 0.175802 0.167577 0.131021 0.131269 0.137622
qa: -0.0773 -0.1789 -0.1878 -0.2228 -0.4042 -0.3744 -0.1364 -0.1884 -0.1757 -0.0684 -0.1642 -0.1234 0.1786 0.0119 -0.1339 -0.1899 -0.1470 -0.1500 0.1104 0.0928 -0.0104 -0.1661 -0.1288 0.1734 -0.1734 -0.1806 0.3880 -0.1571 0.3759 0.2973 0.2821 -0.2271 -0.2285 -0.0423 0.0974 0.0920 0.0798 0.0786 0.0785 0.1206 0.1392 0.1189 0.1190 0.0956 0.0799 0.1181 0.1065 0.1512 0.1081 0.1758 0.1676 0.1310 0.1313 0.1376
va: 1.2295 1.1309 1.1106 1.9574 2.1085 2.1389 2.9170 3.2565 3.1948 3.8098 3.9233 3.9394 3.7744 3.6530 3.9990 4.0131 4.0166 4.0539 3.9140 3.8905 3.7026 3.9846 4.0320 3.8977 3.9831 4.0073 4.3212 3.5798 4.0924 4.0036 3.9869 3.9971 3.9960 3.8455 1.0053 1.0156 1.0182 1.0183 1.0441 1.0283 0.9967 1.0144 1.0160 0.9933 1.0136 1.0201 1.0110 1.0319 1.0167 1.0682 1.0273 1.0089 1.0088 0.9956
dispcorr: -0.026571563 hartree
energy: -2014.656706132650
dipole: -18.96558 21.00313 2.03756 -5.14824 4.51015 -0.63809 13.53108 -12.80534 0.72573
magnitude: 2.25510 au
magnitude: 5.73202 debye
