program: Orca
programVersion: 5.0.2
elementType: Cl Cl Cl F F F F F O O O N N N C C C C C C C C C C C C C C C C C C C C H H H H H H H H H
charge: 0
multiplicity: 1
keywords: wb97x-d3
keywords: def2-TZVPP
keywords: def2/J RIJCOSX
keywords: DEFGRID2
keywords: scfconv7
keywords: smallprint printgap noloewdin
keywords: NOSOSCF
formula: C20H9Cl3F5N3O3
InChI: InChI=1/C20H9Cl3F5N3O3/c21-10-5-9(30-19(33)31-17(32)15-13(24)2-1-3-14(15)25)6-11(22)16(10)34-18-12(23)4-8(7-29-18)20(26,27)28/h1-7,30-31H
43 atoms
Cl -1.380757 1.493455 -2.7800
Cl -1.986462 0.970345 2.502396
Cl -5.467265 2.725433 -0.005906
F  -7.905934 -1.967842 -0.652706
F  -6.371391 -3.471797 -0.511875
F  -7.119781 -2.522621 1.266239
F  7.24821 1.589306 -1.141316
F  6.453819 -2.544558 0.881432
O  -2.831116 1.573982 -0.240079
O  2.930662 -0.084213 2.375654
O  4.815346 0.053564 -1.297432
N  2.550796 0.295459 0.153977
N  4.675147 -0.202739 0.961847
N  -3.444094 -0.639209 -0.295673
C  1.187098 0.578479 0.134412
C  -1.524393 1.197956 -0.12264
C  0.641535 0.861457 -1.11888
C  0.370093 0.603738 1.263032
C  -0.701209 1.155864 -1.236781
C  -0.969774 0.914853 1.114022
C  -3.781032 0.620182 -0.212592
C  -5.735575 -1.244039 -0.126099
C  -5.104635 1.050559 -0.097825
C  6.79968 -0.464235 -0.125922
C  -6.095249 0.099547 -0.050768
C  3.315996 0.005122 1.226276
C  -4.397576 -1.563418 -0.251414
C  5.339679 -0.187448 -0.226305
C  -6.781487 -2.303899 -0.011941
C  7.715962 0.448586 -0.632856
C  7.313874 -1.638299 0.40689
C  9.076144 0.23184 -0.602038
C  8.665373 -1.90778 0.445015
C  9.540426 -0.957771 -0.060108
H  1.268151 0.84408 -2.001452
H  0.75338 0.389515 2.246034
H  3.02813 0.332928 -0.742853
H  -7.12846 0.405171 0.049097
H  -4.060391 -2.589204 -0.320009
H  5.216166 -0.372517 1.801054
H  9.756312 0.976925 -0.991483
H  9.024685 -2.839762 0.858966
H  10.604252 -1.147807 -0.032247
elementType: Cl F O N C H
totalener: -3037.57919196 hartree
nucrepener: 3872.06016300 hartree
electener: -6909.63935496 hartree
twoeener: 4978.30090173 hartree
cpcmener: -0.04063454 hartree
kineticenergy: 3029.54798263 hartree
xcener: -210.653630511548 hartree
chargesum: 0.0000000
charge: -0.054816 -0.057181 -0.053102 -0.179538 -0.177745 -0.178346 -0.203511 -0.207925 -0.307915 -0.511553 -0.462657 -0.163435 -0.149113 -0.338303 0.162811 0.206691 -0.183397 -0.182380 0.026011 0.048715 0.339210 -0.073177 -0.017117 -0.129701 -0.068708 0.436217 0.005622 0.412638 0.553595 0.298528 0.316246 -0.241839 -0.243403 -0.063782 0.132960 0.144237 0.205661 0.141277 0.140417 0.197430 0.155339 0.154812 0.170229
qa: -0.0548 -0.0572 -0.0531 -0.1795 -0.1777 -0.1783 -0.2035 -0.2079 -0.3079 -0.5116 -0.4627 -0.1634 -0.1491 -0.3383 0.1628 0.2067 -0.1834 -0.1824 0.0260 0.0487 0.3392 -0.0732 -0.0171 -0.1297 -0.0687 0.4362 0.0056 0.4126 0.5536 0.2985 0.3162 -0.2418 -0.2434 -0.0638 0.1330 0.1442 0.2057 0.1413 0.1404 0.1974 0.1553 0.1548 0.1702
va: 1.2605 1.2618 1.2604 1.1222 1.1265 1.1108 1.0948 1.0871 2.1435 1.9948 2.0481 3.2599 3.2274 2.9961 3.9606 3.8008 4.0452 4.0371 4.0245 4.0266 3.9599 3.6939 4.0324 3.5474 4.0436 4.2969 4.1211 4.0616 4.4235 3.9540 3.9256 3.9559 3.9574 3.8072 1.0247 1.0483 1.0367 1.0214 1.0092 1.0059 0.9998 1.0001 0.9834
dispcorr: -0.022462749 hartree
energy: -3037.601654704209
dipole: 45.78347 -42.13400 3.64947 -2.43687 1.87832 -0.55855 1.36020 -1.50558 -0.14539
magnitude: 3.69483 au
magnitude: 9.39150 debye
