program: Orca
programVersion: 5.0.2
elementType: Cl Cl Cl F F F F F O O O N N N C C C C C C C C C C C C C C C C C C C C H H H H H H H H H
charge: 0
multiplicity: 1
keywords: wb97x-d3
keywords: def2-TZVPP
keywords: def2/J RIJCOSX
keywords: DEFGRID2
keywords: scfconv7
keywords: smallprint printgap noloewdin
keywords: NOSOSCF
formula: C20H9Cl3F5N3O3
InChI: InChI=1/C20H9Cl3F5N3O3/c21-10-5-9(30-19(33)31-17(32)15-13(24)2-1-3-14(15)25)6-11(22)16(10)34-18-12(23)4-8(7-29-18)20(26,27)28/h1-7,30-31H
43 atoms
Cl -2.003924 0.317059 2.447179
Cl -1.318282 1.868701 -2.626013
Cl -5.361075 2.796267 0.235675
F  -7.35041 -2.330574 1.151787
F  -8.038953 -1.750261 -0.796801
F  -6.590016 -3.328903 -0.596049
F  7.173743 1.94491 -0.634749
F  6.69381 -2.599867 0.361486
O  -2.793769 1.514222 -0.130278
O  2.882004 -0.807165 2.155783
O  4.899872 0.311046 -1.270234
N  2.558303 0.069912 0.070652
N  4.681553 -0.503813 0.843667
N  -3.540212 -0.636658 -0.392134
C  1.192572 0.34705 0.077496
C  -1.508558 1.061304 -0.077823
C  0.355552 0.154532 1.175667
C  0.665352 0.87604 -1.101735
C  -0.976364 0.517202 1.07994
C  -0.670961 1.216633 -1.171737
C  -3.798903 0.625335 -0.182525
C  -5.853042 -1.134113 -0.193324
C  -5.095075 1.116999 -0.000493
C  6.872082 -0.318816 -0.13398
C  -6.133888 0.217612 0.000225
C  3.301417 -0.432849 1.080804
C  -4.539066 -1.510509 -0.397479
C  5.395639 -0.143769 -0.258858
C  -6.955695 -2.138795 -0.115055
C  7.719956 0.757336 -0.371497
C  7.475688 -1.536383 0.152158
C  9.092675 0.649797 -0.314733
C  8.844263 -1.695236 0.20739
C  9.645987 -0.588927 -0.026369
H  0.722655 -0.260425 2.099238
H  1.300823 1.023118 -1.965663
H  3.06294 0.330542 -0.772154
H  -7.146609 0.566189 0.158056
H  -4.260711 -2.541987 -0.570055
H  5.194433 -0.83387 1.651614
H  9.714439 1.516981 -0.491735
H  9.270707 -2.664997 0.425738
H  10.721433 -0.693506 0.01729
elementType: Cl F O N C H
totalener: -3037.59066567 hartree
nucrepener: 3867.55788209 hartree
electener: -6905.14854777 hartree
twoeener: 4973.71431986 hartree
cpcmener: -0.03414094 hartree
kineticenergy: 3029.53093468 hartree
xcener: -210.649039752362 hartree
chargesum: -0.0000000
charge: -0.055877 -0.054608 -0.051322 -0.177772 -0.179361 -0.176893 -0.200736 -0.205993 -0.298359 -0.485157 -0.444242 -0.168585 -0.152557 -0.331665 0.162832 0.202551 -0.180032 -0.184559 0.058533 0.018025 0.340150 -0.076780 -0.018960 -0.127876 -0.076586 0.423338 0.006495 0.400488 0.553518 0.294850 0.311435 -0.237134 -0.241478 -0.063829 0.143226 0.129480 0.200545 0.140073 0.138871 0.193428 0.152603 0.153041 0.166881
qa: -0.0559 -0.0546 -0.0513 -0.1778 -0.1794 -0.1769 -0.2007 -0.2060 -0.2984 -0.4852 -0.4442 -0.1686 -0.1526 -0.3317 0.1628 0.2026 -0.1800 -0.1846 0.0585 0.0180 0.3402 -0.0768 -0.0190 -0.1279 -0.0766 0.4233 0.0065 0.4005 0.5535 0.2948 0.3114 -0.2371 -0.2415 -0.0638 0.1432 0.1295 0.2005 0.1401 0.1389 0.1934 0.1526 0.1530 0.1669
va: 1.2628 1.2603 1.2620 1.1130 1.1217 1.1283 1.0987 1.0890 2.1544 2.0263 2.0703 3.2538 3.2198 2.9998 3.9605 3.8078 4.0357 4.0441 4.0104 4.0296 3.9702 3.6987 4.0283 3.5463 4.0530 4.3108 4.1120 4.0776 4.4260 3.9621 3.9321 3.9562 3.9596 3.8128 1.0488 1.0256 1.0416 1.0219 1.0091 1.0087 1.0006 1.0008 0.9848
dispcorr: -0.022401990 hartree
energy: -3037.613067660848
dipole: 46.07772 -42.46999 3.60773 -2.54422 2.24307 -0.30115 0.93400 -1.01779 -0.08378
magnitude: 3.62124 au
magnitude: 9.20447 debye
