program: Orca
programVersion: 5.0.2
elementType: S O N N N C C C C C C C C C C C C C C C C H H H H H H H H H H H H H H H H H H H H H H H
charge: 0
multiplicity: 1
keywords: wb97x-d3
keywords: def2-TZVPP
keywords: def2/J RIJCOSX
keywords: DEFGRID2
keywords: scfconv7
keywords: smallprint printgap noloewdin
keywords: NOSOSCF
formula: C16H23N3OS
InChI: InChI=1/C16H23N3OS/c1-12(2)19-14(17-16(3,4)5)21-11-18(15(19)20)13-9-7-6-8-10-13/h6-10,12H,11H2,1-5H3
44 atoms
S  0.584446 -1.693297 -0.312165
O  -1.295282 2.102284 0.257982
N  0.62371 1.017236 -0.337926
N  -1.469091 -0.032497 -0.454369
N  2.600806 0.012104 0.254007
C  1.300082 2.335335 -0.453299
C  3.607981 -1.023268 0.454263
C  1.404973 -0.127794 -0.096234
C  -0.755612 1.0844 -0.133768
C  -0.833478 -1.060039 -1.227276
C  2.349269 2.353359 -1.554805
C  1.820204 2.881915 0.869174
C  4.874571 -0.283338 0.88937
C  3.219914 -1.998176 1.569396
C  3.912318 -1.7723 -0.846329
C  -2.829898 -0.154803 -0.084101
C  -3.772591 -0.491149 -1.048968
C  -3.225575 0.017057 1.23895
C  -5.101473 -0.668337 -0.690776
C  -4.558813 -0.139312 1.584464
C  -5.500699 -0.48744 0.625091
H  0.509752 3.004511 -0.787551
H  -1.513508 -1.894476 -1.379013
H  -0.513476 -0.695913 -2.204378
H  2.608074 3.392601 -1.764125
H  3.263662 1.830105 -1.287531
H  1.959244 1.924349 -2.479107
H  1.055372 2.844473 1.645399
H  2.098172 3.929346 0.738539
H  2.695267 2.341451 1.221331
H  5.698014 -0.979843 1.055379
H  4.708018 0.266602 1.817729
H  5.18932 0.433265 0.128309
H  2.398852 -2.662569 1.298019
H  2.931032 -1.460848 2.474527
H  4.0702 -2.634869 1.819734
H  4.751894 -2.453146 -0.696295
H  4.190138 -1.07474 -1.638786
H  3.070651 -2.3655 -1.202208
H  -3.473726 -0.611179 -2.083364
H  -2.497169 0.259346 2.001576
H  -5.825741 -0.938134 -1.44838
H  -4.85988 -0.000838 2.614868
H  -6.538196 -0.619216 0.90321
elementType: S O N C H
totalener: -1261.34733338 hartree
nucrepener: 1919.99546528 hartree
electener: -3181.34279866 hartree
oneelecener: -5537.67104301 hartree
twoeener: 2356.32824435 hartree
cpcmener: -0.02393171 hartree
kineticenergy: 1256.72154477 hartree
xcener: -104.741339136266 hartree
chargesum: 0.0000000
charge: -0.094848 -0.504640 -0.140832 -0.066751 -0.359170 0.150899 0.223499 0.199224 0.374346 -0.075449 -0.304008 -0.315587 -0.302356 -0.320007 -0.318268 0.148919 -0.222257 -0.239844 -0.130547 -0.132869 -0.157624 0.062765 0.136729 0.151355 0.102531 0.088722 0.094472 0.091489 0.099964 0.094269 0.095029 0.093934 0.095404 0.102720 0.103328 0.097969 0.098605 0.100079 0.094537 0.160158 0.151069 0.156808 0.157287 0.158946
qa: -0.0948 -0.5046 -0.1408 -0.0668 -0.3592 0.1509 0.2235 0.1992 0.3743 -0.0754 -0.3040 -0.3156 -0.3024 -0.3200 -0.3183 0.1489 -0.2223 -0.2398 -0.1305 -0.1329 -0.1576 0.0628 0.1367 0.1514 0.1025 0.0887 0.0945 0.0915 0.1000 0.0943 0.0950 0.0939 0.0954 0.1027 0.1033 0.0980 0.0986 0.1001 0.0945 0.1602 0.1511 0.1568 0.1573 0.1589
va: 2.3571 1.9988 3.1813 3.1023 2.9391 3.7581 3.8587 4.1278 4.2769 3.9984 3.9135 3.9122 3.8901 3.9147 3.9164 3.6365 3.9708 4.0277 3.9049 3.9060 3.8945 1.0257 1.0003 0.9982 1.0032 1.0138 1.0072 1.0151 1.0030 1.0140 1.0096 1.0081 1.0056 1.0057 1.0072 1.0058 1.0064 1.0037 1.0258 0.9979 1.0092 0.9923 0.9918 0.9897
dispcorr: -0.022896565 hartree
energy: -1261.370229942530
dipole: 24.36657 -24.44054 -0.07397 1.75339 -3.31004 -1.55665 0.67710 -1.76388 -1.08678
magnitude: 1.89993 au
magnitude: 4.82923 debye
