program: Orca
programVersion: 5.0.2
elementType: O O N N C C C C C C C C C C C C C C C C C C C C C C H H H H H H H H H H H H H H H H H H H H H H H H H H H H
charge: 0
multiplicity: 1
keywords: wb97x-d3
keywords: def2-TZVPP
keywords: def2/J RIJCOSX
keywords: DEFGRID2
keywords: scfconv7
keywords: smallprint printgap noloewdin
keywords: NOSOSCF
formula: C22H28N2O2
InChI: InChI=1/C22H28N2O2/c1-7-17-8-10-18(11-9-17)20(25)23-24(22(4,5)6)21(26)19-13-15(2)12-16(3)14-19/h8-14,23H,7H2,1-6H3
54 atoms
O  -3.510834 -1.564849 -0.039886
O  -0.820014 0.709584 -1.923905
N  -2.451836 0.425457 0.242167
N  -1.214003 1.007476 0.281987
C  -3.663298 1.299253 0.153142
C  -3.229738 2.753011 0.315078
C  -4.341854 1.146428 -1.20832
C  -4.625682 0.960774 1.290782
C  -2.482067 -0.932699 0.138746
C  -1.1680 -1.647977 0.231996
C  -0.409381 0.994754 -0.810429
C  -0.358744 -1.567825 1.362275
C  -0.778351 -2.424362 -0.849386
C  1.022347 1.260493 -0.521578
C  0.859284 -2.232314 1.403544
C  0.444114 -3.093978 -0.834261
C  1.248827 -2.980804 0.292655
C  1.970609 0.551068 -1.255081
C  1.447351 2.107218 0.499628
C  3.749371 1.48728 0.089219
C  1.762835 -2.103336 2.592651
C  0.868341 -3.918101 -2.01237
C  3.315238 0.658191 -0.94317
C  2.796641 2.222376 0.791234
C  5.210072 1.616769 0.408268
C  5.880205 2.704857 -0.42555
H  -2.581761 3.089902 -0.493851
H  -4.125148 3.37439 0.296399
H  -2.72601 2.935408 1.264792
H  -5.156341 1.867895 -1.28636
H  -4.76825 0.15762 -1.359407
H  -3.642057 1.347747 -2.019599
H  -5.474795 1.644476 1.257151
H  -5.020384 -0.050292 1.228224
H  -4.141884 1.082891 2.260828
H  -0.808266 1.130732 1.198705
H  -0.671019 -0.978389 2.217349
H  -1.413336 -2.490853 -1.725297
H  2.206677 -3.489567 0.309903
H  1.65929 -0.113305 -2.050612
H  0.735952 2.691502 1.070439
H  2.300527 -3.029705 2.792597
H  2.512281 -1.326353 2.425894
H  1.209013 -1.831525 3.490425
H  0.267312 -4.825292 -2.095575
H  0.745201 -3.368774 -2.946211
H  1.911738 -4.219867 -1.93452
H  4.038321 0.077888 -1.503689
H  3.112766 2.886599 1.586465
H  5.333904 1.843656 1.468973
H  5.70917 0.662403 0.228394
H  6.939283 2.784377 -0.178723
H  5.421456 3.677997 -0.246244
H  5.801682 2.489848 -1.49194
elementType: O N C H
totalener: -1115.28896922 hartree
nucrepener: 2434.30055372 hartree
electener: -3549.58952294 hartree
oneelecener: -6353.42088750 hartree
twoeener: 2803.83136456 hartree
cpcmener: -0.05053789 hartree
kineticenergy: 1110.22587032 hartree
xcener: -110.513775936075 hartree
chargesum: 0.0000000
charge: -0.526747 -0.517387 -0.040714 -0.096273 0.204336 -0.294720 -0.341321 -0.319638 0.431154 0.059716 0.393507 -0.220103 -0.196842 0.044322 -0.030874 -0.065866 -0.137329 -0.229578 -0.200024 0.005123 -0.217422 -0.227180 -0.150381 -0.155384 -0.063484 -0.262932 0.105613 0.106396 0.107348 0.105116 0.104339 0.099397 0.102262 0.105872 0.101722 0.202153 0.139183 0.129347 0.126646 0.146442 0.152325 0.101696 0.099713 0.098947 0.107656 0.101380 0.094058 0.146073 0.146891 0.078628 0.079450 0.094414 0.086636 0.086339
qa: -0.5267 -0.5174 -0.0407 -0.0963 0.2043 -0.2947 -0.3413 -0.3196 0.4312 0.0597 0.3935 -0.2201 -0.1968 0.0443 -0.0309 -0.0659 -0.1373 -0.2296 -0.2000 0.0051 -0.2174 -0.2272 -0.1504 -0.1554 -0.0635 -0.2629 0.1056 0.1064 0.1073 0.1051 0.1043 0.0994 0.1023 0.1059 0.1017 0.2022 0.1392 0.1293 0.1266 0.1464 0.1523 0.1017 0.0997 0.0989 0.1077 0.1014 0.0941 0.1461 0.1469 0.0786 0.0795 0.0944 0.0866 0.0863
va: 1.9665 1.9825 3.0542 3.1418 3.8222 3.8988 3.9105 3.8950 4.0334 3.5304 4.1230 3.9208 3.9676 3.4972 3.7704 3.7845 3.8408 3.9791 3.9870 3.7119 3.9047 3.9102 3.9290 3.9150 3.8463 3.9197 1.0049 1.0059 1.0047 1.0040 1.0212 1.0157 1.0039 1.0208 1.0068 0.9945 1.0124 1.0223 1.0064 1.0167 1.0049 1.0004 0.9930 1.0030 0.9938 0.9969 1.0046 1.0002 0.9996 1.0059 1.0054 1.0045 1.0021 1.0023
dispcorr: -0.031304612 hartree
energy: -1115.320273836620
dipole: 8.47741 -5.70812 2.76928 7.46150 -5.74953 1.71196 4.38382 -2.02758 2.35624
magnitude: 4.01891 au
magnitude: 10.21525 debye
