program: Orca
programVersion: 5.0.2
elementType: O O N N C C C C C C C C C C C C C C C C C C C C C C H H H H H H H H H H H H H H H H H H H H H H H H H H H H
charge: 0
multiplicity: 1
keywords: wb97x-d3
keywords: def2-TZVPP
keywords: def2/J RIJCOSX
keywords: DEFGRID2
keywords: scfconv7
keywords: smallprint printgap noloewdin
keywords: NOSOSCF
formula: C22H28N2O2
InChI: InChI=1/C22H28N2O2/c1-7-17-8-10-18(11-9-17)20(25)23-24(22(4,5)6)21(26)19-13-15(2)12-16(3)14-19/h8-14,23H,7H2,1-6H3
54 atoms
O  -3.45505 -1.593814 0.161076
O  -0.921573 0.600377 -2.021308
N  -2.427109 0.429238 0.244868
N  -1.206625 1.040801 0.176411
C  -3.664682 1.264821 0.17147
C  -4.533633 0.992292 1.399402
C  -3.264334 2.7377 0.185669
C  -4.432084 0.985198 -1.121309
C  -2.43444 -0.935647 0.245008
C  -1.101281 -1.616336 0.342025
C  -0.467352 0.994454 -0.963247
C  -0.256967 -1.43037 1.433455
C  -0.735992 -2.480436 -0.679506
C  0.958983 1.375595 -0.787145
C  0.971174 -2.075295 1.491602
C  0.49428 -3.134528 -0.646261
C  1.333923 -2.914677 0.438777
C  1.392979 2.309381 0.15177
C  1.90316 0.702428 -1.558558
C  3.699582 1.837267 -0.404627
C  1.913091 -1.830408 2.632639
C  0.886514 -4.060425 -1.758936
C  2.747363 2.538454 0.331916
C  3.254478 0.926186 -1.36026
C  5.165518 2.003811 -0.127897
C  5.643705 1.016873 0.935305
H  -5.400522 1.654539 1.387776
H  -4.905748 -0.029128 1.435126
H  -3.980399 1.187518 2.319721
H  -2.679886 3.022827 -0.689436
H  -2.705682 3.013805 1.080876
H  -4.176027 3.335695 0.175703
H  -4.837505 -0.022865 -1.160254
H  -5.270767 1.678697 -1.201269
H  -3.795771 1.132863 -1.9945
H  -0.761718 1.250982 1.057509
H  -0.551255 -0.77581 2.246715
H  -1.401136 -2.633167 -1.521789
H  2.297383 -3.41239 0.470527
H  0.68402 2.880073 0.740035
H  1.581745 -0.019885 -2.297939
H  2.511184 -2.712769 2.859173
H  2.609076 -1.022995 2.392529
H  1.383119 -1.540976 3.539666
H  0.764571 -3.585894 -2.733584
H  1.924408 -4.379368 -1.669968
H  0.265418 -4.958343 -1.762344
H  3.068008 3.270782 1.0635
H  3.975719 0.377258 -1.954305
H  5.73573 1.851051 -1.046752
H  5.368616 3.024079 0.204552
H  5.114337 1.164012 1.878032
H  6.709998 1.139416 1.129705
H  5.479175 -0.014451 0.619672
elementType: O N C H
totalener: -1115.30196376 hartree
nucrepener: 2432.76504824 hartree
electener: -3548.06701200 hartree
oneelecener: -6350.17471167 hartree
twoeener: 2802.10769967 hartree
cpcmener: -0.03997297 hartree
kineticenergy: 1110.20570093 hartree
xcener: -110.506675352863 hartree
chargesum: 0.0000000
charge: -0.490294 -0.479165 -0.040761 -0.100176 0.202341 -0.319279 -0.294874 -0.336988 0.406968 0.062222 0.367765 -0.223828 -0.194410 0.036093 -0.023751 -0.062668 -0.131854 -0.189636 -0.206498 0.021872 -0.217744 -0.227474 -0.172866 -0.157819 -0.064738 -0.266901 0.100148 0.108435 0.098516 0.106440 0.103812 0.104950 0.106063 0.101542 0.099229 0.194685 0.134239 0.126325 0.123254 0.149483 0.142235 0.099258 0.097255 0.097990 0.101896 0.091651 0.106664 0.142265 0.142849 0.078050 0.078154 0.084750 0.097150 0.087172
qa: -0.4903 -0.4792 -0.0408 -0.1002 0.2023 -0.3193 -0.2949 -0.3370 0.4070 0.0622 0.3678 -0.2238 -0.1944 0.0361 -0.0238 -0.0627 -0.1319 -0.1896 -0.2065 0.0219 -0.2177 -0.2275 -0.1729 -0.1578 -0.0647 -0.2669 0.1001 0.1084 0.0985 0.1064 0.1038 0.1049 0.1061 0.1015 0.0992 0.1947 0.1342 0.1263 0.1233 0.1495 0.1422 0.0993 0.0973 0.0980 0.1019 0.0917 0.1067 0.1423 0.1428 0.0780 0.0782 0.0848 0.0972 0.0872
va: 2.0134 2.0311 3.0285 3.1281 3.8314 3.8953 3.8992 3.9069 4.0621 3.5391 4.1494 3.9273 3.9819 3.5096 3.7833 3.7999 3.8637 3.9784 3.9820 3.7207 3.9074 3.9100 3.9402 3.9428 3.8496 3.9177 1.0046 1.0205 1.0073 1.0045 1.0052 1.0068 1.0224 1.0042 1.0155 0.9999 1.0134 1.0230 1.0073 1.0054 1.0204 1.0010 0.9917 1.0029 0.9965 1.0051 0.9939 1.0017 1.0008 1.0059 1.0058 1.0025 1.0059 1.0019
dispcorr: -0.030911323 hartree
energy: -1115.332875080466
dipole: 8.21895 -5.57028 2.64867 4.56166 -2.79003 1.77162 7.10925 -5.18183 1.92742
magnitude: 3.72412 au
magnitude: 9.46596 debye
