program: Orca
programVersion: 5.0.2
elementType: O O N N C C C C C C C C C C C C C C C C C C C C C C H H H H H H H H H H H H H H H H H H H H H H H H H H H H
charge: 0
multiplicity: 1
keywords: wb97x-d3
keywords: def2-TZVPP
keywords: def2/J RIJCOSX
keywords: DEFGRID2
keywords: scfconv7
keywords: smallprint printgap noloewdin
keywords: NOSOSCF
formula: C22H28N2O2
InChI: InChI=1/C22H28N2O2/c1-7-17-8-10-18(11-9-17)20(25)23-24(22(4,5)6)21(26)19-13-15(2)12-16(3)14-19/h8-14,23H,7H2,1-6H3
54 atoms
O  -3.407151 -1.643861 0.194562
O  -0.969587 0.786252 -1.986643
N  -2.466853 0.422941 0.263388
N  -1.268722 1.083194 0.233945
C  -3.738318 1.205522 0.194325
C  -3.400792 2.693529 0.185623
C  -4.500858 0.876354 -1.089986
C  -4.587735 0.91314 1.431606
C  -2.415185 -0.940663 0.249734
C  -1.04628 -1.556482 0.27694
C  -0.515122 1.089737 -0.899719
C  -0.191482 -1.41216 1.365769
C  -0.648691 -2.298953 -0.825401
C  0.923624 1.394117 -0.680445
C  1.07801 -1.976504 1.344821
C  0.620934 -2.872685 -0.870799
C  1.46944 -2.695055 0.215578
C  1.387277 2.229895 0.333594
C  1.846392 0.722998 -1.478761
C  3.676316 1.66163 -0.206213
C  2.031431 -1.761386 2.482285
C  1.049934 -3.665026 -2.069532
C  2.747567 2.36538 0.558062
C  3.203188 0.848471 -1.233687
C  5.143021 1.727967 0.108469
C  5.547289 0.667361 1.130008
H  -4.338011 3.250724 0.163396
H  -2.857578 3.007058 1.077993
H  -2.826584 2.988895 -0.692926
H  -4.856099 -0.15079 -1.117799
H  -3.877739 1.047615 -1.969069
H  -5.373578 1.527107 -1.169614
H  -4.034387 1.135967 2.34649
H  -5.477535 1.54565 1.421737
H  -4.92372 -0.120562 1.478381
H  -0.822368 1.226496 1.128052
H  -0.508313 -0.84625 2.235667
H  -1.3188 -2.414066 -1.669675
H  2.46539 -3.125894 0.183838
H  0.697011 2.797348 0.94668
H  1.505705 0.077105 -2.277577
H  1.507576 -1.600484 3.424429
H  2.705845 -2.608001 2.610962
H  2.652052 -0.879318 2.302605
H  2.129137 -3.81497 -2.08659
H  0.581912 -4.651682 -2.078268
H  0.76491 -3.168255 -2.997842
H  3.091318 3.024553 1.346547
H  3.90568 0.298424 -1.848833
H  5.723115 1.588962 -0.806268
H  5.394915 2.718053 0.494797
H  5.016192 0.802948 2.073477
H  6.616239 0.719519 1.341385
H  5.330189 -0.337758 0.764992
elementType: O N C H
totalener: -1115.29995020 hartree
nucrepener: 2454.30958265 hartree
electener: -3569.60953285 hartree
oneelecener: -6393.21096295 hartree
twoeener: 2823.60143010 hartree
cpcmener: -0.03946811 hartree
kineticenergy: 1110.19436178 hartree
xcener: -110.505020724095 hartree
chargesum: -0.0000000
charge: -0.490955 -0.474553 -0.035293 -0.105126 0.196071 -0.291357 -0.335431 -0.319400 0.405259 0.069862 0.360875 -0.225767 -0.186649 0.038045 -0.013747 -0.064576 -0.148493 -0.195668 -0.201458 0.025477 -0.215100 -0.228045 -0.172721 -0.161791 -0.058718 -0.276706 0.104792 0.104031 0.106296 0.106937 0.098657 0.101528 0.098541 0.099903 0.107494 0.194243 0.134986 0.126554 0.122015 0.149161 0.143828 0.100529 0.100983 0.089794 0.092666 0.108473 0.100343 0.141771 0.141681 0.078194 0.078648 0.085545 0.100226 0.088145
qa: -0.4910 -0.4746 -0.0353 -0.1051 0.1961 -0.2914 -0.3354 -0.3194 0.4053 0.0699 0.3609 -0.2258 -0.1866 0.0380 -0.0137 -0.0646 -0.1485 -0.1957 -0.2015 0.0255 -0.2151 -0.2280 -0.1727 -0.1618 -0.0587 -0.2767 0.1048 0.1040 0.1063 0.1069 0.0987 0.1015 0.0985 0.0999 0.1075 0.1942 0.1350 0.1266 0.1220 0.1492 0.1438 0.1005 0.1010 0.0898 0.0927 0.1085 0.1003 0.1418 0.1417 0.0782 0.0786 0.0855 0.1002 0.0881
va: 2.0115 2.0354 3.0417 3.1262 3.8340 3.8969 3.9054 3.8985 4.0669 3.5413 4.1747 3.9301 3.9729 3.5092 3.7542 3.7696 3.8445 3.9780 3.9734 3.7060 3.9063 3.9109 3.9247 3.9373 3.8363 3.9221 1.0064 1.0059 1.0054 1.0222 1.0165 1.0044 1.0070 1.0045 1.0207 1.0025 1.0128 1.0211 1.0075 1.0060 1.0178 1.0035 1.0014 0.9924 1.0045 0.9935 0.9980 1.0015 1.0016 1.0060 1.0055 1.0010 1.0066 1.0006
dispcorr: -0.032429367 hartree
energy: -1115.332379563040
dipole: 8.02503 -5.41284 2.61220 3.63178 -2.00301 1.62877 6.84679 -4.93329 1.91350
magnitude: 3.62463 au
magnitude: 9.21308 debye
