program: Orca
programVersion: 5.0.2
elementType: O O N N C C C C C C C C C C C C C C C C C C C C C C H H H H H H H H H H H H H H H H H H H H H H H H H H H H
charge: 0
multiplicity: 1
keywords: wb97x-d3
keywords: def2-TZVPP
keywords: def2/J RIJCOSX
keywords: DEFGRID2
keywords: scfconv7
keywords: smallprint printgap noloewdin
keywords: NOSOSCF
formula: C22H28N2O2
InChI: InChI=1/C22H28N2O2/c1-7-17-8-10-18(11-9-17)20(25)23-24(22(4,5)6)21(26)19-13-15(2)12-16(3)14-19/h8-14,23H,7H2,1-6H3
54 atoms
O  -3.574777 -1.529969 -0.372331
O  -0.767666 1.272547 -1.826059
N  -2.411577 0.346149 0.19026
N  -1.144848 0.826282 0.361627
C  -3.565529 1.290658 0.163713
C  -3.071434 2.690362 0.522781
C  -4.190949 1.335012 -1.231731
C  -4.595904 0.861285 1.211521
C  -2.530182 -0.991426 -0.096472
C  -1.249023 -1.770437 0.006201
C  -0.34426 1.142423 -0.700854
C  -0.494737 -2.030415 -1.124493
C  -0.843166 -2.258917 1.243886
C  1.0892 1.326113 -0.34476
C  0.688362 -2.759447 -1.029689
C  0.322886 -3.003662 1.3603
C  1.080719 -3.234584 0.214148
C  1.820672 2.32266 -0.976635
C  1.734913 0.482444 0.55643
C  3.816662 1.67214 0.223592
C  1.518845 -3.000693 -2.255006
C  0.752038 -3.564828 2.684693
C  3.163065 2.501345 -0.682979
C  3.079728 0.655152 0.827346
C  5.280912 1.814219 0.554408
C  5.952134 3.088978 0.069078
H  -3.933203 3.3577 0.54793
H  -2.603222 2.731088 1.506984
H  -2.373859 3.087763 -0.213222
H  -3.442886 1.60109 -1.976829
H  -4.979585 2.089143 -1.253476
H  -4.634463 0.382647 -1.510244
H  -4.153284 0.842863 2.209226
H  -5.419543 1.576394 1.229634
H  -5.01292 -0.119651 1.000135
H  -0.752465 0.780148 1.288029
H  -0.812427 -1.642569 -2.084948
H  -1.446311 -2.066047 2.124674
H  2.001194 -3.802727 0.296152
H  1.334007 2.964141 -1.699503
H  1.205782 -0.343669 1.016368
H  0.942308 -3.509216 -3.028611
H  1.86986 -2.059331 -2.679739
H  2.392655 -3.612934 -2.036655
H  1.834162 -3.520911 2.808822
H  0.298846 -3.027625 3.517211
H  0.459037 -4.612216 2.77765
H  3.701632 3.298813 -1.177134
H  3.570374 -0.019442 1.519422
H  5.397667 1.737101 1.638775
H  5.81278 0.950171 0.143933
H  5.967915 3.153932 -1.019111
H  6.986806 3.123726 0.408006
H  5.450181 3.978282 0.451541
totalener: -1115.27174646 hartree
nucrepener: 2413.11240454 hartree
electener: -3528.38415100 hartree
oneelecener: -6310.01160400 hartree
twoeener: 2781.62745299 hartree
kineticenergy: 1110.26443136 hartree
xcener: -110.512042235566 hartree
chargesum: 0.0000000
charge: -0.378359 -0.368923 -0.047693 -0.080690 0.153983 -0.269186 -0.314729 -0.294056 0.316974 0.146701 0.242306 -0.178780 -0.223850 0.085755 -0.009822 -0.004342 -0.144551 -0.186355 -0.211943 0.016082 -0.221530 -0.225809 -0.123123 -0.162454 -0.049457 -0.268763 0.090639 0.086649 0.107231 0.110331 0.081224 0.113694 0.078212 0.084768 0.122005 0.158356 0.118855 0.099891 0.089049 0.127846 0.133660 0.104210 0.104445 0.074728 0.086409 0.081478 0.109366 0.117229 0.108647 0.074469 0.081084 0.077823 0.090350 0.089966
qa: -0.3784 -0.3689 -0.0477 -0.0807 0.1540 -0.2692 -0.3147 -0.2941 0.3170 0.1467 0.2423 -0.1788 -0.2238 0.0858 -0.0098 -0.0043 -0.1446 -0.1864 -0.2119 0.0161 -0.2215 -0.2258 -0.1231 -0.1625 -0.0495 -0.2688 0.0906 0.0866 0.1072 0.1103 0.0812 0.1137 0.0782 0.0848 0.1220 0.1584 0.1189 0.0999 0.0890 0.1278 0.1337 0.1042 0.1044 0.0747 0.0864 0.0815 0.1094 0.1172 0.1086 0.0745 0.0811 0.0778 0.0904 0.0900
va: 2.1256 2.1247 2.9875 3.1098 3.9163 3.9058 3.9020 3.8956 4.1266 3.6449 4.2138 3.9933 3.9403 3.5106 3.7865 3.7450 3.9461 4.1249 3.9771 3.8187 3.9167 3.9145 3.9092 4.0898 3.8491 3.9565 1.0107 1.0094 1.0095 1.0181 1.0059 1.0221 1.0110 1.0083 1.0226 1.0294 1.0257 1.0215 1.0142 1.0237 1.0116 0.9978 0.9955 1.0085 1.0017 1.0056 0.9922 1.0093 1.0117 1.0012 0.9963 0.9981 1.0078 0.9997
dispcorr: -0.030705733 hartree
energy: -1115.302452197566
dipole: 8.71634 -6.80574 1.91060 6.68330 -6.15552 0.52778 5.95643 -4.59304 1.36338
magnitude: 2.40577 au
magnitude: 6.11499 debye
